{"text_format":"1","workbook":"xlsx","n_sheets":7,"sheets":["LotInfo","QCData","Verification","F Table","TCrit","Imported QCData","Beta PWL Calculation"],"not_rendered":{"charts":0,"images":1,"macros":1,"external_links":0,"defined_names":117,"comments":2,"pivot_tables":0},"unopened":[],"bounds":{"document_bytes":16777216,"sheet_cells":100000,"rows_first":2000,"rows_last":500,"rows_between":2000,"halvings":0,"cell_chars":16384,"cell_head_chars":4096},"cells_cut":0,"cells_raw":0,"read":"whole","date_system":"1900"}

{"sheet":"LotInfo","index":0,"n_rows":366,"n_cols":54,"rows_kept":366,"cut":false,"hidden":false,"merged":[[16,8,16,11],[9,12,9,16],[0,11,0,12],[6,8,6,9],[0,8,0,9],[183,4,183,7],[61,6,61,17],[4,8,4,16],[5,8,5,9],[9,8,9,9],[7,8,7,9],[5,12,5,16],[7,12,7,16],[8,12,8,16],[6,12,6,16],[11,8,11,9],[15,8,15,11]]}
["LotInfo:",null,null,null,null,null,null,"Contractor QC Mgr Job #",null,null,null,"Enter Lot Number"]
[]
["SPFPay For use only on the Sac 5 Long Life Project  (3/18/19 REV1)",null,null,null,null,null,null,null,null,null,null,null,null,null,null,null,null,"© 2018 California Department of Transportation"]
[]
["http://www.dot.ca.gov/hq/construc/hma/",null,null,null,null,null,null,"Project Name:","SAC 5 Corridor Enhancement Project"]
[null,null,null,null,null,null,null,"EA (or Project ID):","03-0H10U4",null,null,"Contractor:"]
[null,null,null,null,null,null,null,"JMF No.",null,null,null,"HMA Plant:"]
[null,null,null,null,null,null,null,"Co/Rte/PM:","03/Sac/5 PM 9.4 to ",null,null,"QC Manager:"]
[null,null,null,null,null,null,null,null,null,null,null,"Resident Engineer:"]
[null,null,null,null,null,null,null,"HMA Type:","HMA LL RB SAC-5",null,null,"QC Lab:"]
[null,null,null,null,null,null,null,null,null,null,null,null,"Item Price:"]
[null,null,null,null,null,null,null,"Projects Specified PG Grade:",null,null,null,null,"Bid Item #"]
[null,null,null,null,null,null,null,null,null,null,null,null,null,null,null,null,null,null,null,null,null,null,null,null,null,null,null,null,null,null,null,null,null,null,null,null,null,null,null,null,null,null,null,null,null,null,null,null,null,null,null,null," "]
[null,null,null,null,null,null,null,{"$f":"IF(OR(hmatype=mixa1,hmatype=mixa2,hmatype=mixb1,hmatype=mixb2,hmatype=mixc1),\"%RAP Agg in Agg Blend:\",\"\")","v":""},null,{"$f":"IF(OR(hmatype=mixa1,hmatype=mixa2,hmatype=mixb1,hmatype=mixb2,hmatype=mixc1),\"%  (Type A HMA Only)\",\"\")","v":""},null,null,{"$f":"(\"JMF No.: \"&\" \"&jmf)","v":"JMF No.:  "}]
[null,null,null,null,"`"]
[null,null,null,null,null,null,null,"Binder Source:"]
[null,null,null,null,null,null,null,"Add'l Binder Desc:"]
[]
[]
[]
[]
[]
[]
[]
[null,"Quality Characteristic","2\"","1-1/2\"","1\"","3/4\"","1/2\"","3/8\"","#4","#8","#16","#30","#50","#100","#200","B.C.","%MTD","% Air Voids"]
[null,"Target Value"]
[null,"Production Tolerance",{"$f":"IF(VLOOKUP(hmatype,$AB$267:$AQ$294,2,FALSE)=\"\",\"\",VLOOKUP(hmatype,$AB$267:$AQ$294,2,FALSE))","v":""},{"$f":"IF(VLOOKUP(hmatype,$AB$267:$AQ$294,3,FALSE)=\"\",\"\",VLOOKUP(hmatype,$AB$267:$AQ$294,3,FALSE))","v":""},{"$f":"IF(VLOOKUP(hmatype,$AB$267:$AQ$294,4,FALSE)=\"\",\"\",VLOOKUP(hmatype,$AB$267:$AQ$294,4,FALSE))","v":0},{"$f":"IF(VLOOKUP(hmatype,$AB$267:$AQ$294,5,FALSE)=\"\",\"\",VLOOKUP(hmatype,$AB$267:$AQ$294,5,FALSE))","v":5},{"$f":"IF(VLOOKUP(hmatype,$AB$267:$AQ$294,6,FALSE)=\"\",\"\",VLOOKUP(hmatype,$AB$267:$AQ$294,6,FALSE))","v":6},{"$f":"IF(VLOOKUP(hmatype,$AB$267:$AQ$294,7,FALSE)=\"\",\"\",VLOOKUP(hmatype,$AB$267:$AQ$294,7,FALSE))","v":"nsl / mr"},{"$f":"IF(VLOOKUP(hmatype,$AB$267:$AQ$294,8,FALSE)=\"\",\"\",VLOOKUP(hmatype,$AB$267:$AQ$294,8,FALSE))","v":5},{"$f":"IF(VLOOKUP(hmatype,$AB$267:$AQ$294,9,FALSE)=\"\",\"\",VLOOKUP(hmatype,$AB$267:$AQ$294,9,FALSE))","v":5},{"$f":"IF(VLOOKUP(hmatype,$AB$267:$AQ$294,10,FALSE)=\"\",\"\",VLOOKUP(hmatype,$AB$267:$AQ$294,10,FALSE))","v":"nsl / mr"},{"$f":"IF(VLOOKUP(hmatype,$AB$267:$AQ$294,11,FALSE)=\"\",\"\",VLOOKUP(hmatype,$AB$267:$AQ$294,11,FALSE))","v":4},{"$f":"IF(VLOOKUP(hmatype,$AB$267:$AQ$294,12,FALSE)=\"\",\"\",VLOOKUP(hmatype,$AB$267:$AQ$294,12,FALSE))","v":"nsl / mr"},{"$f":"IF(VLOOKUP(hmatype,$AB$267:$AQ$294,13,FALSE)=\"\",\"\",VLOOKUP(hmatype,$AB$267:$AQ$294,13,FALSE))","v":"nsl / mr"},{"$f":"IF(VLOOKUP(hmatype,$AB$267:$AQ$294,14,FALSE)=\"\",\"\",VLOOKUP(hmatype,$AB$267:$AQ$294,14,FALSE))","v":2},{"$f":"IF(VLOOKUP(hmatype,$AB$267:$AQ$294,15,FALSE)=\"\",\"\",VLOOKUP(hmatype,$AB$267:$AQ$294,15,FALSE))","v":0.4},null,{"$f":"VLOOKUP(hmatype,$AB$267:$AR$294,17,FALSE)","v":1.5}]
[null,"Upper Specification Limit",{"$f":"IF(C26=\"\",\"\",IF(C27=\"n/a\",\"n/a\",(IF(C26+C27>100,100,C26+C27))))","v":""},{"$f":"IF(D26=\"\",\"\",IF(D27=\"n/a\",\"n/a\",(IF(D26+D27>100,100,D26+D27))))","v":""},{"$f":"IF(E26=\"\",\"\",IF(E27=\"n/a\",\"n/a\",(IF(E26+E27>100,100,E26+E27))))","v":""},{"$f":"IF(F26=\"\",\"\",IF(F27=\"n/a\",\"n/a\",(IF(F26+F27>100,100,F26+F27))))","v":""},{"$f":"IF(G26=\"\",\"\",IF(G27=\"n/a\",\"n/a\",(IF(G26+G27>100,100,G26+G27))))","v":""},{"$f":"IF(H26=\"\",\"\",IF(H27=\"nsl / mr\",\"nsl / mr\",(IF(H26+H27>100,100,H26+H27))))","v":""},"","","","","","","","",{"$f":"IF(VLOOKUP(hmatype,$AB$312:$AQ$314,16,FALSE)=\"\",\"\",VLOOKUP(hmatype,$AB$312:$AQ$314,16,FALSE))","v":100},{"$f":"IF(OR(R26=\"\",R26=\"n/a\"),\"\",IF(R27=\"nsl / mr\",\"nsl / mr\",(IF(R26+R27>100,100,R26+R27))))","v":""}]
[null,"Lower Specification Limit",{"$f":"IF(C26=\"\",\"\",IF(C27=\"n/a\",\"n/a\",(IF(C26-C27<0,0,C26-C27))))","v":""},{"$f":"IF(D26=\"\",\"\",IF(D27=\"n/a\",\"n/a\",(IF(D26-D27<0,0,D26-D27))))","v":""},{"$f":"IF(E26=\"\",\"\",IF(E27=\"n/a\",\"n/a\",(IF(E26-E27<0,0,E26-E27))))","v":""},{"$f":"IF(F26=\"\",\"\",IF(F27=\"n/a\",\"n/a\",(IF(F26-F27<0,0,F26-F27))))","v":""},{"$f":"IF(G26=\"\",\"\",IF(G27=\"n/a\",\"n/a\",(IF(G26-G27<0,0,G26-G27))))","v":""},{"$f":"IF(H26=\"\",\"\",IF(H27=\"nsl / mr\",\"nsl / mr\",(IF(H26-H27<0,0,H26-H27))))","v":""},{"$f":"IF(I26=\"\",\"\",IF(I27=\"nsl / mr\",\"nsl / mr\",(IF(I26-I27<0,0,I26-I27))))","v":""},"","","","","","","",{"$f":"IF(VLOOKUP(hmatype,$AB$344:$AQ$346,16,FALSE)=\"\",\"\",VLOOKUP(hmatype,$AB$344:$AQ$346,16,FALSE))","v":97},{"$f":"IF(OR(R26=\"\",R26=\"n/a\"),\"\",IF(R27=\"nsl / mr\",\"nsl / mr\",(IF(R26-R27<0,0,R26-R27))))","v":""}]
[null,"Weighting Factor   (w)",{"$f":"VLOOKUP(hmatype,$AB$195:$AQ$222,2,FALSE)","v":0},{"$f":"VLOOKUP(hmatype,$AB$195:$AQ$222,3,FALSE)","v":0},{"$f":"VLOOKUP(hmatype,$AB$195:$AQ$222,4,FALSE)","v":0},{"$f":"VLOOKUP(hmatype,$AB$195:$AQ$222,5,FALSE)","v":0},{"$f":"VLOOKUP(hmatype,$AB$195:$AQ$222,6,FALSE)","v":0},{"$f":"VLOOKUP(hmatype,$AB$195:$AQ$222,7,FALSE)","v":0},{"$f":"VLOOKUP(hmatype,$AB$195:$AQ$222,8,FALSE)","v":0.05},{"$f":"VLOOKUP(hmatype,$AB$195:$AQ$222,9,FALSE)","v":0.1},{"$f":"VLOOKUP(hmatype,$AB$195:$AQ$222,10,FALSE)","v":0},{"$f":"VLOOKUP(hmatype,$AB$195:$AQ$222,11,FALSE)","v":0},{"$f":"VLOOKUP(hmatype,$AB$195:$AQ$222,12,FALSE)","v":0},{"$f":"VLOOKUP(hmatype,$AB$195:$AQ$222,13,FALSE)","v":0},{"$f":"VLOOKUP(hmatype,$AB$195:$AQ$222,14,FALSE)","v":0.15},{"$f":"VLOOKUP(hmatype,$AB$195:$AQ$222,15,FALSE)","v":0.3},{"$f":"VLOOKUP(hmatype,$AB$195:$AQ$222,16,FALSE)","v":0.4},{"$f":"VLOOKUP(hmatype,$AB$195:$AR$222,17,FALSE)","v":0}]
[null,"Values check for 2 in a row=>"]
[null,null,null,null,null,null,null,null,null,"*nsl / mr = no spec limit / must report per CT 202. On target value line, enter value from JMF (CEM-3511)."]
[null,null,null,null,null,null,null,null,null,"Bold target values above are quality characteristics that will be checked against specification limits."]
[]
[]
[]
[]
[]
[]
[]
[]
[]
[]
[]
[]
[]
[]
[]
[]
[]
[]
[]
[]
[]
[]
[]
[]
[]
[]
[]
[]
[]
[]
[]
[]
[]
[]
[]
[]
[]
[]
[]
[]
[]
[]
[]
[]
[]
[]
[]
[]
[]
[]
[]
[]
[]
[]
[]
[]
[]
[]
[]
[]
[]
[]
[]
[]
[]
[]
[null,"Summary of Revisions to SPFPay Program.  (report any bugs or recommendations to pete.spector@dot.ca.gov)",null,null,null,null,null,null,null,null,null,null,null,null,null,null,null,null,null,null,null,null,null,null,null,null,null,null,null,null,null,null,null,null,null,null,null,null,null,null,null,null,null,null,null,null,null,null,null,null,null,null,"Instructions for Setting up Trusted Folders (Eliminates the need to enable Macros each time you open HMAPay)"]
[]
[]
[null,null,null,null,null,null,null,null,null,null,null,null,null,null,null,null,null,null,null,null,null,null,null,null,null,null,null,null,null,null,null,null,null,null,null,null,null,null,null,null,null,null,null,null,null,null,null,null,null,null,null,null,"1. Click the Microsoft Office Button (top left corner), then click Excel Options."]
[]
[null,null,null,null,null,null,null,null,null,null,null,null,null,null,null,null,null,null,null,null,null,null,null,null,null,null,null,null,null,null,null,null,null,null,null,null,null,null,null,null,null,null,null,null,null,null,null,null,null,null,null,null,"2. Click Trust Center, click Trust Center Settings, and then click Trusted Locations."]
[]
[null,null,null,null,null,null,null,null,null,null,null,null,null,null,null,null,null,null,null,null,null,null,null,null,null,null,null,null,null,null,null,null,null,null,null,null,null,null,null,null,null,null,null,null,null,null,null,null,null,null,null,null,"3. If you want to create a trusted location that is not local to your computer, select the Allow trusted locations on my network (not recommended) check box."]
[]
[null,null,null,null,null,null,null,null,null,null,null,null,null,null,null,null,null,null,null,null,null,null,null,null,null,null,null,null,null,null,null,null,null,null,null,null,null,null,null,null,null,null,null,null,null,null,null,null,null,null,null,null,"4. Click Add new location."]
[]
[null,null,null,null,null,null,null,null,null,null,null,null,null,null,null,null,null,null,null,null,null,null,null,null,null,null,null,null,null,null,null,null,null,null,null,null,null,null,null,null,null,null,null,null,null,null,null,null,null,null,null,null,null,"It is recommended that you don't make your entire Documents or My Documents folder a trusted location.  Doing so creates"]
[null,null,null,null,null,null,null,null,null,null,null,null,null,null,null,null,null,null,null,null,null,null,null,null,null,null,null,null,null,null,null,null,null,null,null,null,null,null,null,null,null,null,null,null,null,null,null,null,null,null,null,null,null,"a larger target for a hacker to potentially exploit and increases your security risk.  Create a subfolder within Documents or My Documents, "]
[null,null,null,null,null,null,null,null,null,null,null,null,null,null,null,null,null,null,null,null,null,null,null,null,null,null,null,"  ",null,null,null,null,null,null,null,null,null,null,null,null,null,null,null,null,null,null,null,null,null,null,null,null,null,"and make only that folder a trusted location."]
[]
[null,null,null,null,null,null,null,null,null,null,null,null,null,null,null,null,null,null,null,null,null,null,null,null,null,null,null,null,null,null,null,null,null,null,null,null,null,null,null,null,null,null,null,null,null,null,null,null,null,null,null,null,"5. In the Path box, type the name of the folder that you want to use as a trusted location, or click Browse to locate the folder."]
[null,null,null,null,null,null,null,null,null,null,null,null,null,null,null,null,null,null,null,null,null,null,null,null,null,null,null,"3 Out in One Day"]
[null,null,null,null,null,null,null,null,null,null,null,null,null,null,null,null,null,null,null,null,null,null,null,null,null,null,null,null,null,null,null,null,null,null,null,null,null,null,null,null,null,null,null,null,null,null,null,null,null,null,null,null,"6. If you want to include subfolders as trusted locations, select the Subfolders of this location are also trusted check box."]
[null,null,null,null,null,null,null,null,null,null,null,null,null,null,null,null,null,null,null,null,null,null,null,null,null,null,null,"YES"]
[null,null,null,null,null,null,null,null,null,null,null,null,null,null,null,null,null,null,null,null,null,null,null,null,null,null,null,"NO",null,null,null,null,null,null,null,null,null,null,null,null,null,null,null,null,null,null,null,null,null,null,null,null,"7. In the Description box, type what you want to describe the purpose of the trusted location."]
[]
[null,null,null,null,null,null,null,null,null,null,null,null,null,null,null,null,null,null,null,null,null,null,null,null,null,null,null,null,null,null,null,null,null,null,null,null,null,null,null,null,null,null,null,null,null,null,null,null,null,null,null,null,"8. Click OK."]
[]
[]
[]
[]
[null,null,null,null,null,null,null,null,null,null,null,null,null,null,null,null,null,null,null,null,null,null,null,null,null,null,null,"Data Valadation list for to allow users to determine if the want worksheets to open up at top left corner when sheet is selected."]
[null,null,null,null,null,null,null,null,null,null,null,null,null,null,null,null,null,null,null,null,null,null,null,null,null,null,null,null,null,null,null,null,null,null,null,null,null,null,"Project Spec","Hamburg Wheel Tr.",null,null,"Lot Number Selection List"]
[null,null,null,null,null,null,null,null,null,null,null,null,null,null,null,null,null,null,null,null,null,null,null,null,null,null,null,null,null,null,null,null,null,null,null,null,null,null,"PG Binder ","0.5\" rut","at inflect"]
[null,null,null,null,null,null,null,null,null,null,null,null,null,null,null,null,null,null,null,null,null,null,null,null,null,null,null,null,null,null,null,null,null,null,null,null,null,null,"Grade",null,null,null,1]
[null,null,null,null,null,null,null,null,null,null,null,null,null,null,null,null,null,null,null,null,null,null,null,null,null,null,null,null,null,null,null,null,null,null,null,null,null,null,null,null,null,null,2]
[null,null,null,null,null,null,null,null,null,null,null,null,null,null,null,null,null,null,null,null,null,null,null,null,null,null,null,null,null,null,null,null,null,null,null,null,null,null,"PG 58-22",10000,10000,null,3]
[null,null,null,null,null,null,null,null,null,null,null,null,null,null,null,null,null,null,null,null,null,null,null,null,null,null,null,"Initial file name assembled below, DO NOT MODIFY AB133!!",null,null,null,null,null,null,null,null,null,null,"PG 64-10",15000,10000,null,4]
[null,null,null,null,null,null,null,null,null,null,null,null,null,null,null,null,null,null,null,null,null,null,null,null,null,null,null,{"$f":"\"SPFPayV1-00_\"&ea&\".xlsm\"","v":"SPFPayV1-00_03-0H10U4.xlsm"},null,null,null,null,null,null,null,null,null,null,"PG 64-16",15000,10000,null,5]
[null,null,null,null,null,null,null,null,null,null,null,null,null,null,null,null,null,null,null,null,null,null,null,null,null,null,null,null,null,null,null,null,null,null,null,null,null,null,"PG 64-28",15000,10000,null,6]
[null,null,null,null,null,null,null,null,null,null,null,null,null,null,null,null,null,null,null,null,null,null,null,null,null,null,null,"Comment:",null,null,null,null,null,null,null,null,null,null,"PG 70-10",20000,12500,null,7]
[null,null,null,null,null,null,null,null,null,null,null,null,null,null,null,null,null,null,null,null,null,null,null,null,null,null,null,"This table provided for info only.  During design of the program, it was originally intended to be automated by the user selection.",null,null,null,null,null,null,null,null,null,null,"PG 58-34 M",10000,10000,null,8]
[null,null,null,null,null,null,null,null,null,null,null,null,null,null,null,null,null,null,null,null,null,null,null,null,null,null,null,"For rubberized HMA mixes, spec writer is supposed to specify these air void values.",null,null,null,null,null,null,null,null,null,null,"PG 64-28 M",15000,10000,null,9]
[null,null,null,null,null,null,null,null,null,null,null,null,null,null,null,null,null,null,null,null,null,null,null,null,null,null,null,"This table not used in",null,null,null,null,null,null,"Std ",null,null,null,"PG 76-22 M",25000,15000,null,10]
[null,null,null,null,null,null,null,null,null,null,null,null,null,null,null,null,null,null,null,null,null,null,null,null,null,null,null,"Traffic Index",null,"Region",null,null,null,null,"Spec"]
[null,null,null,null,null,null,null,null,null,null,null,null,null,null,null,null,null,null,null,null,null,null,null,null,null,null,null,null,"mountain ","coast","valley","desert",null,null,"dropdown"]
[null,null,null,null,null,null,null,null,null,null,null,null,null,null,null,null,null,null,null,null,null,null,null,null,null,null,null,"0 to 6",3,3,3,3]
[null,null,null,null,null,null,null,null,null,null,null,null,null,null,null,null,null,null,null,null,null,null,null,null,null,null,null,"> 6 to 10",4,4,4,5,null,null,"OBC(WDA) ..old spec"]
[null,null,null,null,null,null,null,null,null,null,null,null,null,null,null,null,null,null,null,null,null,null,null,null,null,null,null,"> 10",4,5,5,5,null,null,"OBC(TWM) ..new spec"]
[]
[]
[]
[]
[]
[null,null,null,null,null,null,null,null,null,null,null,null,null,null,null,null,null,null,null,null,null,null,null,null,null,null,null,"WHEN ADDING MIX DESIGN(S), ONLY ENTER THE MIX TYPE TEXT IN THE GRAY CELLS, ALL OTHERS MIX TYPE NAMES IN COLUMN AB REFERENCE THE GREY CELLS."]
[null,null,null,null,null,null,null,null,null,null,null,null,null,null,null,null,null,null,null,null,null,null,null,null,null,null,null,"DON’T FORGET TO INCREASE THE DATA VALIDATION LIST WHERE THE MIX TYPE IS SELECTED BY THE USER (in CELL I10)"]
[]
[null,null,null,null,null,null,null,null,null,null,null,null,null,null,null,null,null,null,null,null,null,null,null,null,null,null,null,"vlookupcolumns"]
[null,null,null,null,null,null,null,null,null,null,null,null,null,null,null,null,null,null,null,null,null,null,null,null,null,null,null,1,2,3,4,5,6,7,8,9,10,11,12,13,14,15,16]
[]
[null,null,null,null,null,null,null,null,null,null,null,null,null,null,null,null,null,null,null,null,null,null,null,null,null,null,null,"\"mixxx\" namedcell",null,null,null,null,"Percent Crushed (%min)",null,null,"LA Rattler",null,"FAA(min)","F&E(max)","VMA(min)","VFA","VFA","DP","DP"]
[null,null,null,null,null,null,null,null,null,null,null,null,null,null,null,null,null,null,null,null,null,null,null,null,null,null,null,null,"SE (min)","Stab (min)","Air Voids","%moist (max)","crs 1face","crs 2faces","#4to#8","100 rev","500rev",null,null,null,"min","max","min","max"]
[null,null,null,null,null,null,null,null,null,null,null,null,null,null,null,null,null,null,null,null,null,null,null,null,null,null,"a1",{"$f":"mixa1","v":"1\" HMA Type A"},47,null,null,1,"--",90,70,12,40,45,10,13,65,75,0.6,1.2]
[null,null,null,null,null,null,null,null,null,null,null,null,null,null,null,null,null,null,null,null,null,null,null,null,null,null,"a2",{"$f":"mixa2","v":"3/4\" HMA Type A"},47,null,null,1,"--",90,70,12,40,45,10,13,65,75,0.6,1.2]
[null,null,null,null,null,null,null,null,null,null,null,null,null,null,null,null,null,null,null,null,null,null,null,null,null,null,"b1",{"$f":"mixb1","v":"1/2\" HMA Type A"},47,null,null,1,"--",90,70,12,40,45,10,14,65,75,0.6,1.2]
[null,null,null,null,null,null,null,null,null,null,null,null,null,null,null,null,null,null,null,null,null,null,null,null,null,null,"b2",{"$f":"mixb2","v":"3/8' HMA Type A"},47,null,null,1,"--",90,70,12,40,45,10,14,65,75,0.6,1.2]
[null,null,null,null,null,null,null,null,null,null,null,null,null,null,null,null,null,null,null,null,null,null,null,null,null,null,"c1",{"$f":"mixc1","v":"No.4 HMA Type A "},47,null,null,1,"--",90,70,12,40,45,10,15,65,75,0.6,1.2]
[null,null,null,null,null,null,null,null,null,null,null,null,null,null,null,null,null,null,null,null,null,null,null,null,null,null,"c2",{"$f":"mixc2","v":0}]
[null,null,null,null,null,null,null,null,null,null,null,null,null,null,null,null,null,null,null,null,null,null,null,null,null,null,"d1",{"$f":"mixd1","v":"3/4\" RHMA-G"},47,null,null,1,"--",90,70,12,40,45,"Report Only"]
[null,null,null,null,null,null,null,null,null,null,null,null,null,null,null,null,null,null,null,null,null,null,null,null,null,null,"d2",{"$f":"mixd2","v":"1/2\" RHMA-G"},47,null,null,1,"--",90,70,12,40,45,"Report Only","18.0 - 23.0",65,75,0.6,1.2]
[null,null,null,null,null,null,null,null,null,null,null,null,null,null,null,null,null,null,null,null,null,null,null,null,null,null,"e",{"$f":"mixe","v":0}]
[null,null,null,null,null,null,null,null,null,null,null,null,null,null,null,null,null,null,null,null,null,null,null,null,null,null,"f",{"$f":"mixf","v":"HMA LL UL SAC-5"}]
[null,null,null,null,null,null,null,null,null,null,null,null,null,null,null,null,null,null,null,null,null,null,null,null,null,null,"g",{"$f":"mixg","v":"HMA LL IL SAC-5"}]
[null,null,null,null,null,null,null,null,null,null,null,null,null,null,null,null,null,null,null,null,null,null,null,null,null,null,"h",{"$f":"mixh","v":"HMA LL RB SAC-5"}]
[null,null,null,null,null,null,null,null,null,null,null,null,null,null,null,null,null,null,null,null,null,null,null,null,null,null,"i",{"$f":"mixi","v":0}]
[null,null,null,null,null,null,null,null,null,null,null,null,null,null,null,null,null,null,null,null,null,null,null,null,null,null,"j",{"$f":"mixj","v":0}]
[null,null,null,null,null,null,null,null,null,null,null,null,null,null,null,null,null,null,null,null,null,null,null,null,null,null,"k",{"$f":"mixk","v":0}]
[null,null,null,null,null,null,null,null,null,null,null,null,null,null,null,null,null,null,null,null,null,null,null,null,null,null,"l",{"$f":"mixl","v":0}]
[null,null,null,null,null,null,null,null,null,null,null,null,null,null,null,null,null,null,null,null,null,null,null,null,null,null,"m",{"$f":"mixm","v":0}]
[null,null,null,null,null,null,null,null,null,null,null,null,null,null,null,null,null,null,null,null,null,null,null,null,null,null,"n",{"$f":"mixn","v":0}]
[null,null,null,null,null,null,null,null,null,null,null,null,null,null,null,null,null,null,null,null,null,null,null,null,null,null,"o",{"$f":"mixo","v":0}]
[null,null,null,null,null,null,null,null,null,null,null,null,null,null,null,null,null,null,null,null,null,null,null,null,null,null,"p",{"$f":"mixp","v":0}]
[null,null,null,null,null,null,null,null,null,null,null,null,null,null,null,null,null,null,null,null,null,null,null,null,null,null,"q",{"$f":"mixq","v":0}]
[null,null,null,null,null,null,null,null,null,null,null,null,null,null,null,null,null,null,null,null,null,null,null,null,null,null,"r",{"$f":"mixr","v":0}]
[null,null,null,null,null,null,null,null,null,null,null,null,null,null,null,null,null,null,null,null,null,null,null,null,null,null,"s",{"$f":"mixs","v":0}]
[null,null,null,null,null,null,null,null,null,null,null,null,null,null,null,null,null,null,null,null,null,null,null,null,null,null,"t",{"$f":"mixt","v":0}]
[null,null,null,null,null,null,null,null,null,null,null,null,null,null,null,null,null,null,null,null,null,null,null,null,null,null,"u",{"$f":"mixu","v":0}]
[null,null,null,null,null,null,null,null,null,null,null,null,null,null,null,null,null,null,null,null,null,null,null,null,null,null,"v",{"$f":"mixv","v":0}]
[null,null,null,null,null,null,null,null,null,null,null,null,null,null,null,null,null,null,null,null,null,null,null,null,null,null,"w",{"$f":"mixw","v":0}]
[null,null,null,null,null,null,null,null,null,null,null,null,null,null,null,null,null,null,null,null,null,null,null,null,null,null,"x",{"$f":"mixx","v":0}]
[null,null,null,null,null,null,null,null,null,null,null,null,null,null,null,null,null,null,null,null,null,null,null,null,null,null,null,"spec limit for "]
[]
[]
[null,null,null,null,null,null,null,null,null,null,null,null,null,null,null,null,null,null,null,null,null,null,null,null,null,null,null,null,null,null,null,null,null,null,null,"Not in the specs but need to make weighting factor add up to 1.00"]
[null,null,null,null,null,null,null,null,null,null,null,null,null,null,null,null,null,null,null,null,null,null,null,null,null,null,null,null,null,null,null,null,null,null,null,"is there a limit on this?"]
[null,null,null,null,null,null,null,null,null,null,null,null,null,null,null,null,null,null,null,null,null,null,null,null,null,null,null,null,"2\"","1-1/2\"","1\"","3/4\"","1/2\"","3/8\"","#4","#8","#16","#30","#50","#100","#200","B.C.","%MTD","Air Voids"]
[null,null,null,null,null,null,null,null,null,null,null,null,null,null,null,null,null,null,null,null,null,null,null,null,null,null,null,"vlookupcolumns"]
[null,null,null,null,null,null,null,null,null,null,null,null,null,null,null,null,null,null,null,null,null,null,null,null,null,null,null,1,2,3,4,5,6,7,8,9,10,11,12,13,14,15,16,17,18,19,20,21,22]
[null,null,null,null,null,null,null,null,null,null,null,null,null,null,null,null,null,null,null,null,null,null,null,null,null,null,null,"\"mixxx\" namedcell",null,null,null,null,null,null,null,"V1.09 changed from \"n/a\" to \"nsl / mr\"",null,null,null,"nsl / mr"]
[null,null,null,null,null,null,null,null,null,null,null,null,null,null,null,null,null,null,null,null,null,null,null,null,null,null,null,null,null,null,null,null,"Weighting Factor Table (for Rule 3 ensure cell states nsl / mr, not n/a.  N/A's set Rule 1 text on qc and qa data sheets when it should state rule 3)"]
[null,null,null,null,null,null,null,null,null,null,null,null,null,null,null,null,null,null,null,null,null,null,null,null,null,null,"a1",{"$f":"mixa1","v":"1\" HMA Type A"},0,0,0,0,0,0,0,0.05,0,0,0,0,0.1,0.25,0.4,0.2]
[null,null,null,null,null,null,null,null,null,null,null,null,null,null,null,null,null,null,null,null,null,null,null,null,null,null,"a2",{"$f":"mixa2","v":"3/4\" HMA Type A"},0,0,0,0,0,0,0,0.05,0,0,0,0,0.1,0.25,0.4,0.2]
[null,null,null,null,null,null,null,null,null,null,null,null,null,null,null,null,null,null,null,null,null,null,null,null,null,null,"b1",{"$f":"mixb1","v":"1/2\" HMA Type A"},0,0,0,0,0,0,0,0.05,0,0,0,0,0.1,0.25,0.4,0.2]
[null,null,null,null,null,null,null,null,null,null,null,null,null,null,null,null,null,null,null,null,null,null,null,null,null,null,"b2",{"$f":"mixb2","v":"3/8' HMA Type A"},0,0,0,0,0,0,0,0.05,0,0,0,0,0.1,0.25,0.4,0.2]
[null,null,null,null,null,null,null,null,null,null,null,null,null,null,null,null,null,null,null,null,null,null,null,null,null,null,"c1",{"$f":"mixc1","v":"No.4 HMA Type A "},0,0,0,0,0,0,0,0.05,0,0,0,0,0.1,0.25,0.4,0.2]
[null,null,null,null,null,null,null,null,null,null,null,null,null,null,null,null,null,null,null,null,null,null,null,null,null,null,"c2",{"$f":"mixc2","v":0}]
[null,null,null,null,null,null,null,null,null,null,null,null,null,null,null,null,null,null,null,null,null,null,null,null,null,null,"d1",{"$f":"mixd1","v":"3/4\" RHMA-G"},0,0,0,0,0,0,0,0.05,0,0,0,0,0.1,0.25,0.4,0.2]
[null,null,null,null,null,null,null,null,null,null,null,null,null,null,null,null,null,null,null,null,null,null,null,null,null,null,"d2",{"$f":"mixd2","v":"1/2\" RHMA-G"},0,0,0,0,0,0,0,0.05,0,0,0,0,0.1,0.25,0.4,0.2]
[null,null,null,null,null,null,null,null,null,null,null,null,null,null,null,null,null,null,null,null,null,null,null,null,null,null,"e",{"$f":"mixe","v":0}]
[null,null,null,null,null,null,null,null,null,null,null,null,null,null,null,null,null,null,null,null,null,null,null,null,null,null,"f",{"$f":"mixf","v":"HMA LL UL SAC-5"},0,0,0,0,0,0,0.05,0.1,0,0,0,0,0.15,0.3,0.4,0]
[null,null,null,null,null,null,null,null,null,null,null,null,null,null,null,null,null,null,null,null,null,null,null,null,null,null,"g",{"$f":"mixg","v":"HMA LL IL SAC-5"},0,0,0,0,0,0,0.05,0.1,0,0,0,0,0.15,0.3,0.4,0]
[null,null,null,null,null,null,null,null,null,null,null,null,null,null,null,null,null,null,null,null,null,null,null,null,null,null,"h",{"$f":"mixh","v":"HMA LL RB SAC-5"},0,0,0,0,0,0,0.05,0.1,0,0,0,0,0.15,0.3,0.4,0]
[null,null,null,null,null,null,null,null,null,null,null,null,null,null,null,null,null,null,null,null,null,null,null,null,null,null,"i",{"$f":"mixi","v":0}]
[null,null,null,null,null,null,null,null,null,null,null,null,null,null,null,null,null,null,null,null,null,null,null,null,null,null,"j",{"$f":"mixj","v":0}]
[null,null,null,null,null,null,null,null,null,null,null,null,null,null,null,null,null,null,null,null,null,null,null,null,null,null,"k",{"$f":"mixk","v":0}]
[null,null,null,null,null,null,null,null,null,null,null,null,null,null,null,null,null,null,null,null,null,null,null,null,null,null,"l",{"$f":"mixl","v":0}]
[null,null,null,null,null,null,null,null,null,null,null,null,null,null,null,null,null,null,null,null,null,null,null,null,null,null,"m",{"$f":"mixm","v":0}]
[null,null,null,null,null,null,null,null,null,null,null,null,null,null,null,null,null,null,null,null,null,null,null,null,null,null,"n",{"$f":"mixn","v":0}]
[null,null,null,null,null,null,null,null,null,null,null,null,null,null,null,null,null,null,null,null,null,null,null,null,null,null,"o",{"$f":"mixo","v":0}]
[null,null,null,null,null,null,null,null,null,null,null,null,null,null,null,null,null,null,null,null,null,null,null,null,null,null,"p",{"$f":"mixp","v":0}]
[null,null,null,null,null,null,null,null,null,null,null,null,null,null,null,null,null,null,null,null,null,null,null,null,null,null,"q",{"$f":"mixq","v":0}]
[null,null,null,null,null,null,null,null,null,null,null,null,null,null,null,null,null,null,null,null,null,null,null,null,null,null,"r",{"$f":"mixr","v":0}]
[null,null,null,null,null,null,null,null,null,null,null,null,null,null,null,null,null,null,null,null,null,null,null,null,null,null,"s",{"$f":"mixs","v":0}]
[null,null,null,null,null,null,null,null,null,null,null,null,null,null,null,null,null,null,null,null,null,null,null,null,null,null,"t",{"$f":"mixt","v":0}]
[null,null,null,null,null,null,null,null,null,null,null,null,null,null,null,null,null,null,null,null,null,null,null,null,null,null,"u",{"$f":"mixu","v":0}]
[null,null,null,null,null,null,null,null,null,null,null,null,null,null,null,null,null,null,null,null,null,null,null,null,null,null,"v",{"$f":"mixv","v":0}]
[null,null,null,null,null,null,null,null,null,null,null,null,null,null,null,null,null,null,null,null,null,null,null,null,null,null,"w",{"$f":"mixw","v":0}]
[null,null,null,null,null,null,null,null,null,null,null,null,null,null,null,null,null,null,null,null,null,null,null,null,null,null,"x",{"$f":"mixx","v":0}]
[null,null,null,null,null,null,null,null,null,null,null,null,null,null,null,null,null,null,null,null,null,null,null,null,null,null,null,{"$f":"AB259","v":"spec limit for "},null,null,"a,e","a,b,e,f","a,b,c,e,f","b,c,d,e,f","a,b,c,d,e,f","a,b,c,d,e,f",null,"a,b,c,d","g",null,"a,b,c,d,e,f"]
[]
[]
[null,null,null,null,null,null,null,null,null,null,null,null,null,null,null,null,null,null,null,null,null,null,null,null,null,null,null,"vlookupcolumns"]
[null,null,null,null,null,null,null,null,null,null,null,null,null,null,null,null,null,null,null,null,null,null,null,null,null,null,null,1,2,3,4,5,6,7,8,9,10,11,12,13,14,15,16,17]
[null,null,null,null,null,null,null,null,null,null,null,null,null,null,null,null,null,null,null,null,null,null,null,null,null,null,null,null,"2\"","1-1/2\"","1\"","3/4\"","1/2\"","3/8\"","#4","#8","#16","#30","#50","#100","#200","B.C.","%MTD","%Air Voids"]
[null,null,null,null,null,null,null,null,null,null,null,null,null,null,null,null,null,null,null,null,null,null,null,null,null,null,null,"\"mixxx\" named cells enter mix name text here only"]
[null,null,null,null,null,null,null,null,null,null,null,null,null,null,null,null,null,null,null,null,null,null,null,null,null,null,null,null,null,null,null,null,"Index (i) shown below:"]
[null,null,null,null,null,null,null,null,null,null,null,null,null,null,null,null,null,null,null,null,null,null,null,null,null,null,"a1","1\" HMA Type A",null,null,null,null,null,null,null,1,null,null,null,null,2,3,5,4]
[null,null,null,null,null,null,null,null,null,null,null,null,null,null,null,null,null,null,null,null,null,null,null,null,null,null,"a2","3/4\" HMA Type A",null,null,null,null,null,null,null,1,null,null,null,null,2,3,5,4]
[null,null,null,null,null,null,null,null,null,null,null,null,null,null,null,null,null,null,null,null,null,null,null,null,null,null,"b1","1/2\" HMA Type A",null,null,null,null,null,null,null,1,null,null,null,null,2,3,5,4]
[null,null,null,null,null,null,null,null,null,null,null,null,null,null,null,null,null,null,null,null,null,null,null,null,null,null,"b2","3/8' HMA Type A",null,null,null,null,null,null,null,1,null,null,null,null,2,3,5,4]
[null,null,null,null,null,null,null,null,null,null,null,null,null,null,null,null,null,null,null,null,null,null,null,null,null,null,"c1","No.4 HMA Type A ",null,null,null,null,null,null,null,1,null,null,null,null,2,3,5,4]
[null,null,null,null,null,null,null,null,null,null,null,null,null,null,null,null,null,null,null,null,null,null,null,null,null,null,"c2"]
[null,null,null,null,null,null,null,null,null,null,null,null,null,null,null,null,null,null,null,null,null,null,null,null,null,null,"d1","3/4\" RHMA-G",null,null,null,null,null,null,null,1,null,null,null,null,2,3,5,4]
[null,null,null,null,null,null,null,null,null,null,null,null,null,null,null,null,null,null,null,null,null,null,null,null,null,null,"d2","1/2\" RHMA-G",null,null,null,null,null,null,null,1,null,null,null,null,2,3,5,4]
[null,null,null,null,null,null,null,null,null,null,null,null,null,null,null,null,null,null,null,null,null,null,null,null,null,null,"e"]
[null,null,null,null,null,null,null,null,null,null,null,null,null,null,null,null,null,null,null,null,null,null,null,null,null,null,"f","HMA LL UL SAC-5",null,null,null,null,null,null,1,2,null,null,null,null,3,4,5]
[null,null,null,null,null,null,null,null,null,null,null,null,null,null,null,null,null,null,null,null,null,null,null,null,null,null,"g","HMA LL IL SAC-5",null,null,null,null,null,null,1,2,null,null,null,null,3,4,5]
[null,null,null,null,null,null,null,null,null,null,null,null,null,null,null,null,null,null,null,null,null,null,null,null,null,null,"h","HMA LL RB SAC-5",null,null,null,null,null,null,1,2,null,null,null,null,3,4,5]
[null,null,null,null,null,null,null,null,null,null,null,null,null,null,null,null,null,null,null,null,null,null,null,null,null,null,"i"]
[null,null,null,null,null,null,null,null,null,null,null,null,null,null,null,null,null,null,null,null,null,null,null,null,null,null,"j"]
[null,null,null,null,null,null,null,null,null,null,null,null,null,null,null,null,null,null,null,null,null,null,null,null,null,null,"k"]
[null,null,null,null,null,null,null,null,null,null,null,null,null,null,null,null,null,null,null,null,null,null,null,null,null,null,"l"]
[null,null,null,null,null,null,null,null,null,null,null,null,null,null,null,null,null,null,null,null,null,null,null,null,null,null,"m"]
[null,null,null,null,null,null,null,null,null,null,null,null,null,null,null,null,null,null,null,null,null,null,null,null,null,null,"n"]
[null,null,null,null,null,null,null,null,null,null,null,null,null,null,null,null,null,null,null,null,null,null,null,null,null,null,"o"]
[null,null,null,null,null,null,null,null,null,null,null,null,null,null,null,null,null,null,null,null,null,null,null,null,null,null,"p"]
[null,null,null,null,null,null,null,null,null,null,null,null,null,null,null,null,null,null,null,null,null,null,null,null,null,null,"q"]
[null,null,null,null,null,null,null,null,null,null,null,null,null,null,null,null,null,null,null,null,null,null,null,null,null,null,"r"]
[null,null,null,null,null,null,null,null,null,null,null,null,null,null,null,null,null,null,null,null,null,null,null,null,null,null,"s"]
[null,null,null,null,null,null,null,null,null,null,null,null,null,null,null,null,null,null,null,null,null,null,null,null,null,null,"t"]
[null,null,null,null,null,null,null,null,null,null,null,null,null,null,null,null,null,null,null,null,null,null,null,null,null,null,"u"]
[null,null,null,null,null,null,null,null,null,null,null,null,null,null,null,null,null,null,null,null,null,null,null,null,null,null,"v"]
[null,null,null,null,null,null,null,null,null,null,null,null,null,null,null,null,null,null,null,null,null,null,null,null,null,null,"w"]
[null,null,null,null,null,null,null,null,null,null,null,null,null,null,null,null,null,null,null,null,null,null,null,null,null,null,"x"]
[null,null,null,null,null,null,null,null,null,null,null,null,null,null,null,null,null,null,null,null,null,null,null,null,null,null,null,"spec limit for ",null,null,"a,e","a,b,e,f","a,b,c,e,f","b,c,d,e,f","a,b,c,d,e,f","a,b,c,d,e,f",null,"a,b,c,d","g",null,"a,b,c,d,e,f"]
[]
[null,null,null,null,null,null,null,null,null,null,null,null,null,null,null,null,null,null,null,null,null,null,null,null,null,null,null,null,"2\"","1-1/2\"","1\"","3/4\"","1/2\"","3/8\"","#4","#8","#16","#30","#50","#100","#200","B.C.","%MTD","%Air Voids"]
[null,null,null,null,null,null,null,null,null,null,null,null,null,null,null,null,null,null,null,null,null,null,null,null,null,null,null,null,null,null,null,null,null,null,null,null,null,null,null,null,null,null,null,null,null,null,null,"col for info only.Used for AX287toAX289"]
[null,null,null,null,null,null,null,null,null,null,null,null,null,null,null,null,null,null,null,null,null,null,null,null,null,null,null,null,"2\"","1-1/2\"","1\"","3/4\"","1/2\"","3/8\"","#4","#8","#16","#30","#50","#100","#200","B.C.","%MTD","%Air Voids"]
[null,null,null,null,null,null,null,null,null,null,null,null,null,null,null,null,null,null,null,null,null,null,null,null,null,null,null,"vlookupcolumns",null,null,"changed n/a to 0",null,null,null,null,null,null,null,null,null,null,null,null,"air voids +",null,null,null,null,"Lower MTD","Upper MTD"]
[null,null,null,null,null,null,null,null,null,null,null,null,null,null,null,null,null,null,null,null,null,null,null,null,null,null,null,1,2,3,4,5,6,7,8,9,10,11,12,13,14,15,16,17,18,19,null,21,22,23,24,25,26]
[null,null,null,null,null,null,null,null,null,null,null,null,null,null,null,null,null,null,null,null,null,null,null,null,null,null,"mixdesx",null,null,null,null,null,"+ or -  % Allowable Tolerances shown below (if 0, then only applys to usl)",null,null,null,null,null,null,null,null,null,null,null,null,"mixdesx - hmatype "]
[null,null,null,null,null,null,null,null,null,null,null,null,null,null,null,null,null,null,null,null,null,null,null,null,null,null,"a1",{"$f":"mixa1","v":"1\" HMA Type A"},null,null,0,5,6,6,7,5,"nsl / mr",4,4,"nsl / mr",2,0.4,null,1.5,null,{"$f":"\"mix\"&AA267&\"  - \"&AB267","v":"mixa1  - 1\" HMA Type A"},null,0.04,92,96]
[null,null,null,null,null,null,null,null,null,null,null,null,null,null,null,null,null,null,null,null,null,null,null,null,null,null,"a2",{"$f":"mixa2","v":"3/4\" HMA Type A"},null,null,0,5,6,"nsl / mr",5,5,"nsl / mr",4,"nsl / mr","nsl / mr",2,0.4,null,1.5,null,{"$f":"\"mix\"&AA268&\"  - \"&AB268","v":"mixa2  - 3/4\" HMA Type A"},null,0.04,92,96]
[null,null,null,null,null,null,null,null,null,null,null,null,null,null,null,null,null,null,null,null,null,null,null,null,null,null,"b1",{"$f":"mixb1","v":"1/2\" HMA Type A"},null,null,null,0,5,5,5,5,"nsl / mr",4,"nsl / mr","nsl / mr",2,0.4,null,1.5,null,"mixb1  - 1/2\" HMA Type A",null,0.04,92,96]
[null,null,null,null,null,null,null,null,null,null,null,null,null,null,null,null,null,null,null,null,null,null,null,null,null,null,"b2",{"$f":"mixb2","v":"3/8' HMA Type A"},null,null,null,null,0,5,5,5,"nsl / mr",5,"nsl / mr","nsl / mr",2,0.4,null,1.5,null,"mixb2  - 3/8' HMA Type A",null,0.04,92,96]
[null,null,null,null,null,null,null,null,null,null,null,null,null,null,null,null,null,null,null,null,null,null,null,null,null,null,"c1",{"$f":"mixc1","v":"No.4 HMA Type A "},null,null,null,null,null,0,5,6,"nsl / mr",5,"nsl / mr","nsl / mr",4,0.4,null,1.5,null,"mixc1  - No.4 HMA Type A ",null,0.04,92,96]
[null,null,null,null,null,null,null,null,null,null,null,null,null,null,null,null,null,null,null,null,null,null,null,null,null,null,"c2",{"$f":"mixc2","v":0},null,null,null,null,null,null,null,null,null,null,null,null,null,null,null,null,null,"mixc2  - 0",null,0.04]
[null,null,null,null,null,null,null,null,null,null,null,null,null,null,null,null,null,null,null,null,null,null,null,null,null,null,"d1",{"$f":"mixd1","v":"3/4\" RHMA-G"},null,null,0,5,6,5,6,5,"nsl / mr","nsl / mr","nsl / mr","nsl / mr",2,0.45,null,2,null,"mixd1  - 3/4\" RHMA-G",null,0.04,91,96]
[null,null,null,null,null,null,null,null,null,null,null,null,null,null,null,null,null,null,null,null,null,null,null,null,null,null,"d2",{"$f":"mixd2","v":"1/2\" RHMA-G"},null,null,null,0,6,5,6,5,"nsl / mr","nsl / mr","nsl / mr","nsl / mr",2,0.45,null,2,null,"mixd2  - 1/2\" RHMA-G",null,0.04,91,96]
[null,null,null,null,null,null,null,null,null,null,null,null,null,null,null,null,null,null,null,null,null,null,null,null,null,null,"e",{"$f":"mixe","v":0},null,null,null,null,null,null,null,null,null,null,null,null,null,null,null,null,null,"mixe  - 0",null,"\"3,4, or 5%"]
[null,null,null,null,null,null,null,null,null,null,null,null,null,null,null,null,null,null,null,null,null,null,null,null,null,null,"f",{"$f":"mixf","v":"HMA LL UL SAC-5"},null,null,0,5,6,"nsl / mr",5,5,"nsl / mr",4,"nsl / mr","nsl / mr",2,0.4,null,1.5,null,"mixf  - HMA LL UL SAC-5",null,"\"3,4, or 5%"]
[null,null,null,null,null,null,null,null,null,null,null,null,null,null,null,null,null,null,null,null,null,null,null,null,null,null,"g",{"$f":"mixg","v":"HMA LL IL SAC-5"},null,null,0,5,6,"nsl / mr",5,5,"nsl / mr",4,"nsl / mr","nsl / mr",2,0.4,null,1.5,null,"mixg  - HMA LL IL SAC-5",null,0.05]
[null,null,null,null,null,null,null,null,null,null,null,null,null,null,null,null,null,null,null,null,null,null,null,null,null,null,"h",{"$f":"mixh","v":"HMA LL RB SAC-5"},null,null,0,5,6,"nsl / mr",5,5,"nsl / mr",4,"nsl / mr","nsl / mr",2,0.4,null,1.5,null,"mixh  - HMA LL RB SAC-5",null,0.04]
[null,null,null,null,null,null,null,null,null,null,null,null,null,null,null,null,null,null,null,null,null,null,null,null,null,null,"i",{"$f":"mixi","v":0},null,null,null,null,null,null,null,null,null,null,null,null,null,null,null,null,null,"mixi  - 0",null,0.05]
[null,null,null,null,null,null,null,null,null,null,null,null,null,null,null,null,null,null,null,null,null,null,null,null,null,null,"j",{"$f":"mixj","v":0},null,null,null,null,null,null,null,null,null,null,null,null,null,null,null,null,null,"mixj  - 0",null,0.04]
[null,null,null,null,null,null,null,null,null,null,null,null,null,null,null,null,null,null,null,null,null,null,null,null,null,null,"k",{"$f":"mixk","v":0},null,null,null,null,null,null,null,null,null,null,null,null,null,null,null,null,null,"mixk  - 0",null,0.05]
[null,null,null,null,null,null,null,null,null,null,null,null,null,null,null,null,null,null,null,null,null,null,null,null,null,null,"l",{"$f":"mixl","v":0},null,null,null,null,null,null,null,null,null,null,null,null,null,null,null,null,null,"mixl  - 0",null,0.04]
[null,null,null,null,null,null,null,null,null,null,null,null,null,null,null,null,null,null,null,null,null,null,null,null,null,null,"m",{"$f":"mixm","v":0},null,null,null,null,null,null,null,null,null,null,null,null,null,null,null,null,null,"mixm  - 0",null,"n/a"]
[null,null,null,null,null,null,null,null,null,null,null,null,null,null,null,null,null,null,null,null,null,null,null,null,null,null,"n",{"$f":"mixn","v":0},null,null,null,null,null,null,null,null,null,null,null,null,null,null,null,null,null,"mixn  - 0",null,"n/a"]
[null,null,null,null,null,null,null,null,null,null,null,null,null,null,null,null,null,null,null,null,null,null,null,null,null,null,"o",{"$f":"mixo","v":0},null,null,null,null,null,null,null,null,null,null,null,null,null,null,null,null,null,"mixo  - 0",null,"\"3,4, or 5%","Data Validation for air voids entry"]
[null,null,null,null,null,null,null,null,null,null,null,null,null,null,null,null,null,null,null,null,null,null,null,null,null,null,"p",{"$f":"mixp","v":0},null,null,null,null,null,null,null,null,null,null,null,null,null,null,null,null,null,"mixp  - 0",null,null,"After selecting a mix type, the range below will yield indicating which air voids are possible"]
[null,null,null,null,null,null,null,null,null,null,null,null,null,null,null,null,null,null,null,null,null,null,null,null,null,null,"q",{"$f":"mixq","v":0},null,null,null,null,null,null,null,null,null,null,null,null,null,null,null,null,null,"mixq  - 0",null,null,"\"4%",{"$f":"IF(OR(hmatype=mixa1,hmatype=mixa2, hmatype=mixb1,hmatype=mixb2,\nhmatype=mixc1,hmatype=mixc2,hmatype=mixd1,hmatype=mixd2,hmatype=mixh,hmatype=mixj,hmatype=mixl,hmatype=mixt,hmatype=mixv,hmatype=mixw,hmatype=mixx),\n1,0)","v":1},"<=add to equation when hmatypes are added (if necessary)"]
[null,null,null,null,null,null,null,null,null,null,null,null,null,null,null,null,null,null,null,null,null,null,null,null,null,null,"r",{"$f":"mixr","v":0},null,null,null,null,null,null,null,null,null,null,null,null,null,null,null,null,null,"mixr  - 0",null,null,"\"5%",{"$f":"IF(OR(hmatype=mixg,hmatype=mixi,hmatype=mixk),1,0)","v":0},"<=add to equation when hmatypes are added (if necessary)"]
[null,null,null,null,null,null,null,null,null,null,null,null,null,null,null,null,null,null,null,null,null,null,null,null,null,null,"s",{"$f":"mixs","v":0},null,null,null,null,null,null,null,null,null,null,null,null,null,null,null,null,null,"mixs  - 0",null,null,"\"3,4, or 5%",{"$f":"IF(OR(hmatype=mixe,hmatype=mixf,hmatype=mixs,hmatype=mixo),1,0)","v":0},"<=add to equation when hmatypes are added (if necessary)"]
[null,null,null,null,null,null,null,null,null,null,null,null,null,null,null,null,null,null,null,null,null,null,null,null,null,null,"t",{"$f":"mixt","v":0},null,null,null,null,null,null,null,null,null,null,null,null,null,null,null,null,null,"mixt  - 0",null,0.04,"\"n/a\"",{"$f":"IF(OR(hmatype=mixm,hmatype=mixn),1,0)","v":0},"<=add to equation when hmatypes are added (if necessary)"]
[null,null,null,null,null,null,null,null,null,null,null,null,null,null,null,null,null,null,null,null,null,null,null,null,null,null,"u",{"$f":"mixu","v":0},null,null,null,null,null,null,null,null,null,null,null,null,null,null,null,null,null,"mixu  - 0"]
[null,null,null,null,null,null,null,null,null,null,null,null,null,null,null,null,null,null,null,null,null,null,null,null,null,null,"v",{"$f":"mixv","v":0},null,null,null,null,null,null,null,null,null,null,null,null,null,null,null,null,null,"mixv  - 0",null,0.04]
[null,null,null,null,null,null,null,null,null,null,null,null,null,null,null,null,null,null,null,null,null,null,null,null,null,null,"w",{"$f":"mixw","v":0},null,null,null,null,null,null,null,null,null,null,null,null,null,null,null,null,null,"mixw  - 0",null,0.04]
[null,null,null,null,null,null,null,null,null,null,null,null,null,null,null,null,null,null,null,null,null,null,null,null,null,null,"x",{"$f":"mixx","v":0},null,null,null,null,null,null,null,null,null,null,null,null,null,null,null,null,null,"mixx  - 0",null,0.04]
[]
[null,null,null,null,null,null,null,null,null,null,null,null,null,null,null,null,null,null,null,null,null,null,null,null,null,null,null,"vlookupcolumns"]
[null,null,null,null,null,null,null,null,null,null,null,null,null,null,null,null,null,null,null,null,null,null,null,null,null,null,null,1,2,3,4,5,6,7,8,9,10,11,12,13,14,15,16,17]
[null,null,null,null,null,null,null,null,null,null,null,null,null,null,null,null,null,null,null,null,null,null,null,null,null,null,null,"Upper end limit=>",{"$f":"VLOOKUP(hmatype,$AB$303:$AQ$330,2,FALSE)","v":100},{"$f":"VLOOKUP(hmatype,$AB$303:$AQ$330,3,FALSE)","v":100},{"$f":"VLOOKUP(hmatype,$AB$303:$AQ$330,4,FALSE)","v":100},{"$f":"VLOOKUP(hmatype,$AB$303:$AQ$330,5,FALSE)","v":98},{"$f":"VLOOKUP(hmatype,$AB$303:$AQ$330,6,FALSE)","v":90},{"$f":"VLOOKUP(hmatype,$AB$303:$AQ$330,7,FALSE)","v":90},{"$f":"VLOOKUP(hmatype,$AB$303:$AQ$330,8,FALSE)","v":58},{"$f":"VLOOKUP(hmatype,$AB$303:$AQ$330,9,FALSE)","v":43},{"$f":"VLOOKUP(hmatype,$AB$303:$AQ$330,10,FALSE)","v":43},{"$f":"VLOOKUP(hmatype,$AB$303:$AQ$330,11,FALSE)","v":23},{"$f":"VLOOKUP(hmatype,$AB$303:$AQ$330,12,FALSE)","v":23},{"$f":"VLOOKUP(hmatype,$AB$303:$AQ$330,13,FALSE)","v":23},{"$f":"VLOOKUP(hmatype,$AB$303:$AQ$330,14,FALSE)","v":7},{"$f":"VLOOKUP(hmatype,$AB$303:$AQ$330,15,FALSE)","v":100},{"$f":"IF(VLOOKUP(hmatype,$AB$267:$AX$294,23,FALSE)=\"\",\"\",VLOOKUP(hmatype,$AB$267:$AX$294,23,FALSE))","v":""}]
[null,null,null,null,null,null,null,null,null,null,null,null,null,null,null,null,null,null,null,null,null,null,null,null,null,null,null,"Lower end limit=>",{"$f":"VLOOKUP(hmatype,$AB$335:$AQ$362,2,FALSE)","v":100},{"$f":"VLOOKUP(hmatype,$AB$335:$AQ$362,3,FALSE)","v":100},{"$f":"VLOOKUP(hmatype,$AB$335:$AQ$362,4,FALSE)","v":100},{"$f":"VLOOKUP(hmatype,$AB$335:$AQ$362,5,FALSE)","v":90},{"$f":"VLOOKUP(hmatype,$AB$335:$AQ$362,6,FALSE)","v":70},{"$f":"VLOOKUP(hmatype,$AB$335:$AQ$362,7,FALSE)","v":42},{"$f":"VLOOKUP(hmatype,$AB$335:$AQ$362,8,FALSE)","v":42},{"$f":"VLOOKUP(hmatype,$AB$335:$AQ$362,9,FALSE)","v":29},{"$f":"VLOOKUP(hmatype,$AB$335:$AQ$362,10,FALSE)","v":10},{"$f":"VLOOKUP(hmatype,$AB$335:$AQ$362,11,FALSE)","v":10},{"$f":"VLOOKUP(hmatype,$AB$335:$AQ$362,12,FALSE)","v":2},{"$f":"VLOOKUP(hmatype,$AB$335:$AQ$362,13,FALSE)","v":2},{"$f":"VLOOKUP(hmatype,$AB$335:$AQ$362,14,FALSE)","v":2},{"$f":"VLOOKUP(hmatype,$AB$335:$AQ$362,15,FALSE)","v":0},{"$f":"IF(VLOOKUP(hmatype,$AB$267:$AX$294,22,FALSE)=\"\",\"\",VLOOKUP(hmatype,$AB$267:$AX$294,22,FALSE))","v":""}]
[null,null,null,null,null,null,null,null,null,null,null,null,null,null,null,null,null,null,null,null,null,null,null,null,null,null,null,null,"2\"","1-1/2\"","1\"","3/4\"","1/2\"","3/8\"","#4","#8","#16","#30","#50","#100","#200","B.C.","%MTD","%Air Voids","SE",null,"(Also don't forget to modify the three \"charts\" cells BA3 and BA4 to make the red lines and markers plot according to the text pulled from AQ267 to AQ194"]
[null,null,null,null,null,null,null,null,null,null,null,null,null,null,null,null,null,null,null,null,null,null,null,null,null,null,null,null,"Target values upper end limit"]
[null,null,null,null,null,null,null,null,null,null,null,null,null,null,null,null,null,null,null,null,null,null,null,null,null,null,"mixdesx",null,null,null,null,null,null,"Red values have no listed requirement but rely on next larger sieve with a spec value shown in black"]
[null,null,null,null,null,null,null,null,null,null,null,null,null,null,null,null,null,null,null,null,null,null,null,null,null,null,"a1",{"$f":"mixa1","v":"1\" HMA Type A"},100,100,100,93,85,70,52,40,24,24,18,28,7,100,null,4]
[null,null,null,null,null,null,null,null,null,null,null,null,null,null,null,null,null,null,null,null,null,null,null,null,null,null,"a2",{"$f":"mixa2","v":"3/4\" HMA Type A"},100,100,100,98,90,90,58,43,43,23,23,23,7,100,null,4]
[null,null,null,null,null,null,null,null,null,null,null,null,null,null,null,null,null,null,null,null,null,null,null,null,null,null,"b1",{"$f":"mixb1","v":"1/2\" HMA Type A"},null,null,null,100,98,95,69,55,55,30,30,30,8,100,null,4]
[null,null,null,null,null,null,null,null,null,null,null,null,null,null,null,null,null,null,null,null,null,null,null,null,null,null,"b2",{"$f":"mixb2","v":"3/8' HMA Type A"},null,null,null,null,100,98,75,50,50,35,35,35,9,100,null,4]
[null,null,null,null,null,null,null,null,null,null,null,null,null,null,null,null,null,null,null,null,null,null,null,null,null,null,"c1",{"$f":"mixc1","v":"No.4 HMA Type A "},null,null,null,null,null,100,98,80,80,45,45,45,12,100,null,4]
[null,null,null,null,null,null,null,null,null,null,null,null,null,null,null,null,null,null,null,null,null,null,null,null,null,null,"c2",{"$f":"mixc2","v":0}]
[null,null,null,null,null,null,null,null,null,null,null,null,null,null,null,null,null,null,null,null,null,null,null,null,null,null,"d1",{"$f":"mixd1","v":"3/4\" RHMA-G"},100,100,100,98,87,70,42,22,22,22,22,22,6,100,null,4]
[null,null,null,null,null,null,null,null,null,null,null,null,null,null,null,null,null,null,null,null,null,null,null,null,null,null,"d2",{"$f":"mixd2","v":"1/2\" RHMA-G"},100,100,100,100,98,87,42,22,22,22,22,22,6,100,null,4]
[null,null,null,null,null,null,null,null,null,null,null,null,null,null,null,null,null,null,null,null,null,null,null,null,null,null,"e",{"$f":"mixe","v":0}]
[null,null,null,null,null,null,null,null,null,null,null,null,null,null,null,null,null,null,null,null,null,null,null,null,null,null,"f",{"$f":"mixf","v":"HMA LL UL SAC-5"},100,100,100,98,90,90,58,43,43,23,23,23,7,100,97]
[null,null,null,null,null,null,null,null,null,null,null,null,null,null,null,null,null,null,null,null,null,null,null,null,null,null,"g",{"$f":"mixg","v":"HMA LL IL SAC-5"},100,100,100,98,90,90,58,43,43,23,23,23,7,100,97]
[null,null,null,null,null,null,null,null,null,null,null,null,null,null,null,null,null,null,null,null,null,null,null,null,null,null,"h",{"$f":"mixh","v":"HMA LL RB SAC-5"},100,100,100,98,90,90,58,43,43,23,23,23,7,100,100]
[null,null,null,null,null,null,null,null,null,null,null,null,null,null,null,null,null,null,null,null,null,null,null,null,null,null,"i",{"$f":"mixi","v":0}]
[null,null,null,null,null,null,null,null,null,null,null,null,null,null,null,null,null,null,null,null,null,null,null,null,null,null,"j",{"$f":"mixj","v":0}]
[null,null,null,null,null,null,null,null,null,null,null,null,null,null,null,null,null,null,null,null,null,null,null,null,null,null,"k",{"$f":"mixk","v":0}]
[null,null,null,null,null,null,null,null,null,null,null,null,null,null,null,null,null,null,null,null,null,null,null,null,null,null,"l",{"$f":"mixl","v":0}]
[null,null,null,null,null,null,null,null,null,null,null,null,null,null,null,null,null,null,null,null,null,null,null,null,null,null,"m",{"$f":"mixm","v":0}]
[null,null,null,null,null,null,null,null,null,null,null,null,null,null,null,null,null,null,null,null,null,null,null,null,null,null,"n",{"$f":"mixn","v":0}]
[null,null,null,null,null,null,null,null,null,null,null,null,null,null,null,null,null,null,null,null,null,null,null,null,null,null,"o",{"$f":"mixo","v":0}]
[null,null,null,null,null,null,null,null,null,null,null,null,null,null,null,null,null,null,null,null,null,null,null,null,null,null,"p",{"$f":"mixp","v":0}]
[null,null,null,null,null,null,null,null,null,null,null,null,null,null,null,null,null,null,null,null,null,null,null,null,null,null,"q",{"$f":"mixq","v":0}]
[null,null,null,null,null,null,null,null,null,null,null,null,null,null,null,null,null,null,null,null,null,null,null,null,null,null,"r",{"$f":"mixr","v":0}]
[null,null,null,null,null,null,null,null,null,null,null,null,null,null,null,null,null,null,null,null,null,null,null,null,null,null,"s",{"$f":"mixs","v":0}]
[null,null,null,null,null,null,null,null,null,null,null,null,null,null,null,null,null,null,null,null,null,null,null,null,null,null,"t",{"$f":"mixt","v":0}]
[null,null,null,null,null,null,null,null,null,null,null,null,null,null,null,null,null,null,null,null,null,null,null,null,null,null,"u",{"$f":"mixu","v":0}]
[null,null,null,null,null,null,null,null,null,null,null,null,null,null,null,null,null,null,null,null,null,null,null,null,null,null,"v",{"$f":"mixv","v":0}]
[null,null,null,null,null,null,null,null,null,null,null,null,null,null,null,null,null,null,null,null,null,null,null,null,null,null,"w",{"$f":"mixw","v":0}]
[null,null,null,null,null,null,null,null,null,null,null,null,null,null,null,null,null,null,null,null,null,null,null,null,null,null,"x",{"$f":"mixx","v":0}]
[null,null,null,null,null,null,null,null,null,null,null,null,null,null,null,null,null,null,null,null,null,null,null,null,null,null,null,"vlookupcolumns"]
[null,null,null,null,null,null,null,null,null,null,null,null,null,null,null,null,null,null,null,null,null,null,null,null,null,null,null,1,2,3,4,5,6,7,8,9,10,11,12,13,14,15,16,17]
[null,null,null,null,null,null,null,null,null,null,null,null,null,null,null,null,null,null,null,null,null,null,null,null,null,null,null,null,"2\"","1-1/2\"","1\"","3/4\"","1/2\"","3/8\"","#4","#8","#16","#30","#50","#100","#200","B.C.","%MTD","%Air Voids","SE"]
[null,null,null,null,null,null,null,null,null,null,null,null,null,null,null,null,null,null,null,null,null,null,null,null,null,null,"mixdesx",null,"Target values lower limit",null,null,null,null,"Red values have no listed requirement but rely on next smaller sieve with a spec value shown in black"]
[null,null,null,null,null,null,null,null,null,null,null,null,null,null,null,null,null,null,null,null,null,null,null,null,null,null,"a1",{"$f":"mixa1","v":"1\" HMA Type A"},100,100,100,88,72,55,35,22,8,8,5,3,3,0]
[null,null,null,null,null,null,null,null,null,null,null,null,null,null,null,null,null,null,null,null,null,null,null,null,null,null,"a2",{"$f":"mixa2","v":"3/4\" HMA Type A"},100,100,100,90,70,42,42,29,10,10,2,2,2,0]
[null,null,null,null,null,null,null,null,null,null,null,null,null,null,null,null,null,null,null,null,null,null,null,null,null,null,"b1",{"$f":"mixb1","v":"1/2\" HMA Type A"},null,null,null,100,95,72,52,35,15,15,2,2,2,0]
[null,null,null,null,null,null,null,null,null,null,null,null,null,null,null,null,null,null,null,null,null,null,null,null,null,null,"b2",{"$f":"mixb2","v":"3/8' HMA Type A"},null,null,null,null,100,95,55,30,15,15,2,2,2,0]
[null,null,null,null,null,null,null,null,null,null,null,null,null,null,null,null,null,null,null,null,null,null,null,null,null,null,"c1",{"$f":"mixc1","v":"No.4 HMA Type A "},null,null,null,null,null,100,95,70,34,34,2,2,2,0]
[null,null,null,null,null,null,null,null,null,null,null,null,null,null,null,null,null,null,null,null,null,null,null,null,null,null,"c2",{"$f":"mixc2","v":0}]
[null,null,null,null,null,null,null,null,null,null,null,null,null,null,null,null,null,null,null,null,null,null,null,null,null,null,"d1",{"$f":"mixd1","v":"3/4\" RHMA-G"},100,100,100,95,83,65,28,14,0,0,0,0,0,7.5]
[null,null,null,null,null,null,null,null,null,null,null,null,null,null,null,null,null,null,null,null,null,null,null,null,null,null,"d2",{"$f":"mixd2","v":"1/2\" RHMA-G"},100,100,100,100,90,83,28,14,0,0,0,0,0,7.5]
[null,null,null,null,null,null,null,null,null,null,null,null,null,null,null,null,null,null,null,null,null,null,null,null,null,null,"e",{"$f":"mixe","v":0}]
[null,null,null,null,null,null,null,null,null,null,null,null,null,null,null,null,null,null,null,null,null,null,null,null,null,null,"f",{"$f":"mixf","v":"HMA LL UL SAC-5"},100,100,100,90,70,42,42,29,10,10,2,2,2,0,94]
[null,null,null,null,null,null,null,null,null,null,null,null,null,null,null,null,null,null,null,null,null,null,null,null,null,null,"g",{"$f":"mixg","v":"HMA LL IL SAC-5"},100,100,100,90,70,42,42,29,10,10,2,2,2,0,94]
[null,null,null,null,null,null,null,null,null,null,null,null,null,null,null,null,null,null,null,null,null,null,null,null,null,null,"h",{"$f":"mixh","v":"HMA LL RB SAC-5"},100,100,100,90,70,42,42,29,10,10,2,2,2,0,97]
[null,null,null,null,null,null,null,null,null,null,null,null,null,null,null,null,null,null,null,null,null,null,null,null,null,null,"i",{"$f":"mixi","v":0}]
[null,null,null,null,null,null,null,null,null,null,null,null,null,null,null,null,null,null,null,null,null,null,null,null,null,null,"j",{"$f":"mixj","v":0}]
[null,null,null,null,null,null,null,null,null,null,null,null,null,null,null,null,null,null,null,null,null,null,null,null,null,null,"k",{"$f":"mixk","v":0}]
[null,null,null,null,null,null,null,null,null,null,null,null,null,null,null,null,null,null,null,null,null,null,null,null,null,null,"l",{"$f":"mixl","v":0}]
[null,null,null,null,null,null,null,null,null,null,null,null,null,null,null,null,null,null,null,null,null,null,null,null,null,null,"m",{"$f":"mixm","v":0}]
[null,null,null,null,null,null,null,null,null,null,null,null,null,null,null,null,null,null,null,null,null,null,null,null,null,null,"n",{"$f":"mixn","v":0}]
[null,null,null,null,null,null,null,null,null,null,null,null,null,null,null,null,null,null,null,null,null,null,null,null,null,null,"o",{"$f":"mixo","v":0}]
[null,null,null,null,null,null,null,null,null,null,null,null,null,null,null,null,null,null,null,null,null,null,null,null,null,null,"p",{"$f":"mixp","v":0}]
[null,null,null,null,null,null,null,null,null,null,null,null,null,null,null,null,null,null,null,null,null,null,null,null,null,null,"q",{"$f":"mixq","v":0}]
[null,null,null,null,null,null,null,null,null,null,null,null,null,null,null,null,null,null,null,null,null,null,null,null,null,null,"r",{"$f":"mixr","v":0}]
[null,null,null,null,null,null,null,null,null,null,null,null,null,null,null,null,null,null,null,null,null,null,null,null,null,null,"s",{"$f":"mixs","v":0}]
[null,null,null,null,null,null,null,null,null,null,null,null,null,null,null,null,null,null,null,null,null,null,null,null,null,null,"t",{"$f":"mixt","v":0}]
[null,null,null,null,null,null,null,null,null,null,null,null,null,null,null,null,null,null,null,null,null,null,null,null,null,null,"u",{"$f":"mixu","v":0}]
[null,null,null,null,null,null,null,null,null,null,null,null,null,null,null,null,null,null,null,null,null,null,null,null,null,null,"v",{"$f":"mixv","v":0}]
[null,null,null,null,null,null,null,null,null,null,null,null,null,null,null,null,null,null,null,null,null,null,null,null,null,null,"w",{"$f":"mixw","v":0}]
[null,null,null,null,null,null,null,null,null,null,null,null,null,null,null,null,null,null,null,null,null,null,null,null,null,null,"x",{"$f":"mixx","v":0}]
[null,null,null,null,null,null,null,null,null,null,null,null,null,null,null,null,null,null,null,null,null,null,null,null,null,null,null,"vlookupcolumns"]
[null,null,null,null,null,null,null,null,null,null,null,null,null,null,null,null,null,null,null,null,null,null,null,null,null,null,null,1,2,3,4,5,6,7,8,9,10,11,12,13,14,15,16,17]
[]
[null,null,null,null,null,null,null,null,null,null,null,null,null,null,null,null,null,null,null,null,null,null,null,null,null,null,null,null,null,null,null,null,"no spec limit, must report"]

{"sheet":"QCData","index":1,"n_rows":56,"n_cols":130,"rows_kept":56,"cut":false,"hidden":false,"merged":[]}
["QCData: Contractor enters QC data and exports the data (emails exported file to resident engineer)."]
["                          Resident engineer imports QC data emailed by contractor.",null,null,null,null,null,null,null,null,null,null,null,null,null,"EA(or Project ID):",{"$f":"IF(ea=\"\",\"\",ea)","v":"03-0H10U4"}]
[null,null,null,null,null,null,null,null,null,null,null,null,null,null,"Resident Engineer:",{"$f":"IF(resengrname=\"\",\"\",resengrname)","v":""},null,null,null,null,null,null,null,null,null,null,null,null,null,"Count test values violating Rule 1 or Rule 2"]
[null,null,null,null,null,null,null,null,null,null,null,null,null,null,"Quality Control Manager:",{"$f":"IF(qcmanagername=\"\",\"\",qcmanagername)","v":""},null,null,null,null,null,null,null,null,null,null,null,null,null,"Code (for Rule 1): 0, 1, 2, 3, …….===> Number of times QC data out of tolerance"]
[null,null,null,null,null,null,null,null,null,null,null,null,null,null,"HMA Type:",{"$f":"IF(hmatype=\"\",\"\",hmatype)","v":"HMA LL RB SAC-5"},null,null,null,null,null,null,null,null,null,null,null,null,null,"Code (for Rule 2): 888 ===> QF less than 0.75; 999 ===> QF less than 0.9"]
[null,null,null,null,null,null,null,null,null,null,null,null,null,null,null,{"$f":"LotInfo!M14","v":"JMF No.:  "}]
[null,null,null,null,null,null,null,null,null,null,null,null,null,null,null,{"$f":"LotInfo!M15","v":0}]
[]
[null,null,null,null,null,null,null,null,null,null,"exported QCdata file name defaults to =>",{"$f":"CONCATENATE(ea,\"_\",LotInfo!M15,\"_\",\"QCData.xls\")","v":"03-0H10U4__QCData.xls"},null,null,null,null,null,null,null,null,null,null,null,null,null,null,null,null,null,"Documentation on logic used in this section:"]
[null,null,null,null,null,null,null,null,null,null,null,null,null,null,null,null,null,null,null,null,null,null,null,null,null,null,null,null,null,"If there is a weighting factor, and the test value is out of spec limits then cell equals 1, no reason to count number out in a row if a weighting factor exists."]
[null,null,null,null,null,null,null,null,null,null,null,null,null,null,null,null,null,null,null,null,null,null,null,null,null,null,null,null,null,"Otherwise cell could still have a weighting factor and test value is in spec, …. If so, then cell value is set to 0."]
[null,null,null,null,"Rule 1",null,"If no weighting factor, but has a specification limit, two failed tests in a row requires stop production, terminate lot. One time for Hamburg Tests",null,null,null,null,null,null,null,null,null,null,null,null,null,null,null,null,null,null,null,null,null,null,"Also, if charachteristic  not reportable (\"nr\"), or no spec limit exists,  but the values must be reported (\"nsl / mr\"), then also set the cell value equal to 0."]
[null,null,null,null,"Rule 2",null,"If weighting factor, a QFQC must be calculated. If cell goes red, QFQC is too low, stop production, terminate lot.",null,null,null,null,null,null,null,null,null,null,null,null,null,null,null,null,null,null,null,null,null,null,"If none of the above, then charachteristic has a spec limit, now count how many in a row are out of spec."]
[]
[null,null,null,null,"Rule 3",null,"No specification limits. Report test value only (per CT 202)",null,null,null,null,null,null,null,null,null,null,null,null,null,null,null,null,null,null,null,null,null,null,"Rule 1","If no weighting factor, but has spec limit, then two failed tests in a row requires ending lot."]
[null,null,null,null,"Rule 4",null,"3 Failing Tests in 1 Day",null,null,null,null,null,null,null,null,null,null,null,null,null,null,null,null,null,null,null,null,null,null,"Rule 2","If weighting factor, a QFQC must be calculated for the last 20 tests (including overlap from previous lots)"]
[null,null,null,null,null,null,null,null,null,null,null,null,null,null,null,null,null,null,null,null,null,null,null,null,null,null,null,null,null,null,null,"The QFQC will also be calculated for on through 5, 5, …20 until twenty tests are recorded."]
[null,null,null,null,null,null,null,null,null,null,null,null,null,null,null,null,null,null,null,null,null,null,null,null,null,null,null,null,null,"Rule 3","No Specification Check Rules, Simply report value"]
[null,null,null,null,null,"JMF Target Value",null,{"$f":"IF(LotInfo!D26=\"\",\"\",LotInfo!D26)","v":""},{"$f":"IF(LotInfo!E26=\"\",\"\",LotInfo!E26)","v":""},{"$f":"IF(LotInfo!F26=\"\",\"\",LotInfo!F26)","v":""},{"$f":"IF(LotInfo!G26=\"\",\"\",LotInfo!G26)","v":""},{"$f":"IF(LotInfo!H26=\"\",\"\",LotInfo!H26)","v":""},{"$f":"IF(LotInfo!I26=\"\",\"\",LotInfo!I26)","v":""},{"$f":"IF(LotInfo!J26=\"\",\"\",LotInfo!J26)","v":""},{"$f":"IF(LotInfo!K26=\"\",\"\",LotInfo!K26)","v":""},{"$f":"IF(LotInfo!L26=\"\",\"\",LotInfo!L26)","v":""},{"$f":"IF(LotInfo!M26=\"\",\"\",LotInfo!M26)","v":""},{"$f":"IF(LotInfo!N26=\"\",\"\",LotInfo!N26)","v":""},{"$f":"IF(LotInfo!O26=\"\",\"\",LotInfo!O26)","v":""},{"$f":"IF(LotInfo!P26=\"\",\"\",LotInfo!P26)","v":""},null,null,null,null,null,null,{"$f":"IF(LotInfo!Q26=\"\",\"\",LotInfo!Q26)","v":""},{"$f":"IF(LotInfo!R26=\"\",\"\",LotInfo!R26)","v":""},null,"Rule 4","No reporting required."]
[]
[null,null,null,null,null,"Upper Specification Limit",{"$f":"LotInfo!C28","v":""},{"$f":"LotInfo!D28","v":""},{"$f":"LotInfo!E28","v":""},{"$f":"LotInfo!F28","v":""},{"$f":"LotInfo!G28","v":""},{"$f":"LotInfo!H28","v":""},{"$f":"LotInfo!I28","v":""},{"$f":"LotInfo!J28","v":""},{"$f":"LotInfo!K28","v":""},{"$f":"LotInfo!L28","v":""},{"$f":"LotInfo!M28","v":""},{"$f":"LotInfo!N28","v":""},{"$f":"LotInfo!O28","v":""},{"$f":"LotInfo!P28","v":""},null,null,null,null,null,null,{"$f":"LotInfo!Q28","v":100},{"$f":"LotInfo!R28","v":""},null,{"$f":"F21","v":"Upper Specification Limit"},{"$f":"LotInfo!C28","v":""},{"$f":"LotInfo!D28","v":""},{"$f":"LotInfo!E28","v":""},{"$f":"LotInfo!F28","v":""},{"$f":"LotInfo!G28","v":""},{"$f":"LotInfo!H28","v":""},{"$f":"LotInfo!I28","v":""},{"$f":"LotInfo!J28","v":""},{"$f":"LotInfo!K28","v":""},{"$f":"LotInfo!L28","v":""},{"$f":"LotInfo!M28","v":""},{"$f":"LotInfo!N28","v":""},{"$f":"LotInfo!O28","v":""},{"$f":"LotInfo!P28","v":""},{"$f":"LotInfo!Q28","v":100},{"$f":"LotInfo!R28","v":""},"Upper Specification Limit",{"$f":"LotInfo!I28","v":""},{"$f":"LotInfo!J28","v":""},{"$f":"LotInfo!O28","v":""},{"$f":"LotInfo!P28","v":""},{"$f":"LotInfo!Q28","v":100},{"$f":"LotInfo!R28","v":""},null,"Upper Specification Limit",{"$f":"LotInfo!I28","v":""},{"$f":"LotInfo!J28","v":""},{"$f":"LotInfo!O28","v":""},{"$f":"LotInfo!P28","v":""},{"$f":"LotInfo!Q28","v":100},{"$f":"LotInfo!R28","v":""}]
[null,null,null,null,null,"Lower Specification Limit",{"$f":"LotInfo!C29","v":""},{"$f":"LotInfo!D29","v":""},{"$f":"LotInfo!E29","v":""},{"$f":"LotInfo!F29","v":""},{"$f":"LotInfo!G29","v":""},{"$f":"LotInfo!H29","v":""},{"$f":"LotInfo!I29","v":""},{"$f":"LotInfo!J29","v":""},{"$f":"LotInfo!K29","v":""},{"$f":"LotInfo!L29","v":""},{"$f":"LotInfo!M29","v":""},{"$f":"LotInfo!N29","v":""},{"$f":"LotInfo!O29","v":""},{"$f":"LotInfo!P29","v":""},null,null,null,null,null,null,{"$f":"LotInfo!Q29","v":97},{"$f":"LotInfo!R29","v":""},null,{"$f":"F22","v":"Lower Specification Limit"},{"$f":"LotInfo!C29","v":""},{"$f":"LotInfo!D29","v":""},{"$f":"LotInfo!E29","v":""},{"$f":"LotInfo!F29","v":""},{"$f":"LotInfo!G29","v":""},{"$f":"LotInfo!H29","v":""},{"$f":"LotInfo!I29","v":""},{"$f":"LotInfo!J29","v":""},{"$f":"LotInfo!K29","v":""},{"$f":"LotInfo!L29","v":""},{"$f":"LotInfo!M29","v":""},{"$f":"LotInfo!N29","v":""},{"$f":"LotInfo!O29","v":""},{"$f":"LotInfo!P29","v":""},{"$f":"LotInfo!Q29","v":97},{"$f":"LotInfo!R29","v":""},"Lower Specification Limit",{"$f":"LotInfo!I29","v":""},{"$f":"LotInfo!J29","v":""},{"$f":"LotInfo!O29","v":""},{"$f":"LotInfo!P29","v":""},{"$f":"LotInfo!Q29","v":97},{"$f":"LotInfo!R29","v":""},null,"Lower Specification Limit",{"$f":"LotInfo!I29","v":""},{"$f":"LotInfo!J29","v":""},{"$f":"LotInfo!O29","v":""},{"$f":"LotInfo!P29","v":""},{"$f":"LotInfo!Q29","v":97},{"$f":"LotInfo!R29","v":""}]
[null,null,null,null,null,{"$f":"LotInfo!B30","v":"Weighting Factor   (w)"},{"$f":"LotInfo!C30","v":0},{"$f":"LotInfo!D30","v":0},{"$f":"LotInfo!E30","v":0},{"$f":"LotInfo!F30","v":0},{"$f":"LotInfo!G30","v":0},{"$f":"LotInfo!H30","v":0},{"$f":"LotInfo!I30","v":0.05},{"$f":"LotInfo!J30","v":0.1},{"$f":"LotInfo!K30","v":0},{"$f":"LotInfo!L30","v":0},{"$f":"LotInfo!M30","v":0},{"$f":"LotInfo!N30","v":0},{"$f":"LotInfo!O30","v":0.15},{"$f":"LotInfo!P30","v":0.3},null,null,null,null,null,null,{"$f":"LotInfo!Q30","v":0.4},{"$f":"LotInfo!R30","v":0},null,{"$f":"LotInfo!B30","v":"Weighting Factor   (w)"},{"$f":"LotInfo!C30","v":0},{"$f":"LotInfo!D30","v":0},{"$f":"LotInfo!E30","v":0},{"$f":"LotInfo!F30","v":0},{"$f":"LotInfo!G30","v":0},{"$f":"LotInfo!H30","v":0},{"$f":"LotInfo!I30","v":0.05},{"$f":"LotInfo!J30","v":0.1},{"$f":"LotInfo!K30","v":0},{"$f":"LotInfo!L30","v":0},{"$f":"LotInfo!M30","v":0},{"$f":"LotInfo!N30","v":0},{"$f":"LotInfo!O30","v":0.15},{"$f":"LotInfo!P30","v":0.3},{"$f":"LotInfo!Q30","v":0.4},{"$f":"LotInfo!R30","v":0},"Weighting Factor   (w)",{"$f":"LotInfo!I30","v":0.05},{"$f":"LotInfo!J30","v":0.1},{"$f":"LotInfo!O30","v":0.15},{"$f":"LotInfo!P30","v":0.3},{"$f":"LotInfo!Q30","v":0.4},{"$f":"LotInfo!R30","v":0},null,"Weighting Factor   (w)",{"$f":"LotInfo!I30","v":0.05},{"$f":"LotInfo!J30","v":0.1},{"$f":"LotInfo!O30","v":0.15},{"$f":"LotInfo!P30","v":0.3},{"$f":"LotInfo!Q30","v":0.4},{"$f":"LotInfo!R30","v":0}]
[null,null,null,null,null,"Rule used to check Quality",{"$f":"IF((AND(G$22=\"nsl / mr\", G$23=0)),rule3,IF(G$23=0,rule1,rule2))","v":"Rule 1"},"Rule 1","Rule 1","Rule 1","Rule 1","Rule 1","Rule 2","Rule 2","Rule 1","Rule 1","Rule 1","Rule 1","Rule 2","Rule 2",null,null,null,null,null,null,{"$f":"IF((AND(AA$22=\"nsl / mr\", AA$23=0)),rule3,IF(AA$23=0,rule1,rule2))","v":"Rule 2"},"Rule 1",null,null,{"$f":"G24","v":"Rule 1"},"Rule 1","Rule 1","Rule 1","Rule 1","Rule 1","Rule 2","Rule 2","Rule 1","Rule 1","Rule 1","Rule 1","Rule 2","Rule 2",{"$f":"AA24","v":"Rule 2"},{"$f":"AB24","v":"Rule 1"},null,{"$f":"M24","v":"Rule 2"},{"$f":"N24","v":"Rule 2"},{"$f":"S24","v":"Rule 2"},{"$f":"T24","v":"Rule 2"},{"$f":"AA24","v":"Rule 2"},{"$f":"AB24","v":"Rule 1"},null,null,{"$f":"M24","v":"Rule 2"},{"$f":"N24","v":"Rule 2"},{"$f":"S24","v":"Rule 2"},{"$f":"T24","v":"Rule 2"},{"$f":"AA24","v":"Rule 2"},{"$f":"AB24","v":"Rule 1"}]
[null,null,null,null,null,"Quality Characteristic","2\"","1-1/2\"","1\"","3/4\"","1/2\"","3/8\"","#4","#8","#16","#30","#50","#100","#200","B.C.",null,null,null,null,null,null,"%MTD","% Air Voids",null,"Quality Characteristic","2\"","1-1/2\"","1\"","3/4\"","1/2\"","3/8\"","#4","#8","#16","#30","#50","#100","#200","B.C.","%MTD","Air Voids","Quality Characteristic","#4","#8","#200","B.C.","%MTD","Air Voids",null,"Quality Characteristic","#4","#8","#200","B.C.","%MTD","%AV"]
[1]
["TEST NO.","Date","Contractor's Est","Lot No.","Sublot No","3 Out",null,null,null,null,null,null,null,null,null,null,null,null,null,null,null,null,null,null,null,null,null,null,null,null,null,null,null,null,null,null,null,"Beta PWL UL Xs",null,null,null,null,null,null,null,null,null,null,null,null,"Beta PWL LL Xs",null,null,null,null,null,null,null,"QF",null,null,"Composite"]
[null,null,"of SubLot Quantity",null,null,"in 1 Day?",null,null,null,null,null,null,null,null,null,null,null,null,null,null,"Density","Density","Density","Briquette 1","Briquette 2","Briquette 3","Average","Average",null,null,null,null,null,null,null,null,null,null,null,null,null,null,null,null,null,null,null,null,null,null,null,null,null,null,null,null,null,null,null,null,null,"QF"]
[null,null,"(tons)",null,null,"Yes or NO",null,null,null,null,null,null,null,null,null,null,null,null,null,null,"Core 1","Core 2","Core 3","Air Voids","Air Voids","Air Voids","Density","Air Voids"]
[null,null,null,null,null,null,null,null,null,null,null,null,null,null,null,null,null,null,null,null,null,null,null,null,null,null,{"$f":"IF(OR(U30=\"\",V30=\"\",W30=\"\"),\"\",AVERAGE(U30:W30))","v":""},{"$f":"IF(OR(X30=\"\",Y30=\"\",Z30=\"\"),\"\",AVERAGE(X30:Z30))","v":""},null,null,{"$f":" IF((AND(AE$24=rule1,AND(G30>0.01,OR(G30>AE$21,G30<AE$22)))),AE29+1,0)","v":0},{"$f":" IF((AND(AF$24=rule1,AND(H30>0.01,OR(H30>AF$21,H30<AF$22)))),AF29+1,0)","v":0},{"$f":" IF((AND(AG$24=rule1,AND(I30>0.01,OR(I30>AG$21,I30<AG$22)))),AG29+1,0)","v":0},{"$f":" IF((AND(AH$24=rule1,AND(J30>0.01,OR(J30>AH$21,J30<AH$22)))),AH29+1,0)","v":0},{"$f":" IF((AND(AI$24=rule1,AND(K30>0.01,OR(K30>AI$21,K30<AI$22)))),AI29+1,0)","v":0},{"$f":" IF((AND(AJ$24=rule1,AND(L30>0.01,OR(L30>AJ$21,L30<AJ$22)))),AJ29+1,0)","v":0},"No Calc","No Calc",{"$f":" IF((AND(AM$24=rule1,AND(O30>0.01,OR(O30>AM$21,O30<AM$22)))),AM29+1,0)","v":0},{"$f":" IF((AND(AN$24=rule1,AND(P30>0.01,OR(P30>AN$21,P30<AN$22)))),AN29+1,0)","v":0},{"$f":" IF((AND(AO$24=rule1,AND(Q30>0.01,OR(Q30>AO$21,Q30<AO$22)))),AO29+1,0)","v":0},{"$f":" IF((AND(AP$24=rule1,AND(R30>0.01,OR(R30>AP$21,R30<AP$22)))),AP29+1,0)","v":0},"No Calc","No Calc","No Calc","No Calc",null,"No Calc","No Calc","No Calc","No Calc","No Calc","No Calc",null,null,"No Calc","No Calc","No Calc","No Calc","No Calc","No Calc","No Calc",null,null,null,null,null,null,null,null,null,null,null,null,null,null,null,null,null,null,null,null,null,null,null,null,null,null,null,null,null,null,null,null,null,null,null,null,null,null,null,null,null,null,"x2","2008-09-11",null,1,1,"YES",null,null,null,95,null,65,null,40,29,11,null,null,3,5.8,95.2,95.2,97,3.9,4,4.0999999999999996]
[null,null,null,null,null,null,null,null,null,null,null,null,null,null,null,null,null,null,null,null,null,null,null,null,null,null,"","",null,null,0,0,0,0,0,0,"No Calc","No Calc",0,0,0,0,"No Calc","No Calc","No Calc","No Calc",null,"No Calc","No Calc","No Calc","No Calc","No Calc","No Calc",null,null,"No Calc","No Calc","No Calc","No Calc","No Calc","No Calc","No Calc",null,null,null,null,null,null,null,null,null,null,null,null,null,null,null,null,null,null,null,null,null,null,null,null,null,null,null,null,null,null,null,null,null,null,null,null,null,null,null,null,null,null,null,null,null,1,2,"NO",null,null,null,94,null,66,null,40,23,12,null,null,4.9000000000000004,5.8,94.2,96,97]
[null,null,null,null,null,null,null,null,null,null,null,null,null,null,null,null,null,null,null,null,null,null,null,null,null,null,"","",null,null,0,0,0,0,0,0,{"$f":"IF((MAX(0,(0.5-(($AK$21-AVERAGE($M$30:M32))/(IF(STDEV($M$30:M32)<0.01,0.01,STDEV($M$30:M32)))*SQRT(COUNT($M$30:M32))/(2*(COUNT($M$30:M32)-1))))))>1,1,(MAX(0,(0.5-(($AK$21-AVERAGE($M$30:M32))/(IF(STDEV($M$30:M32)<0.01,0.01,STDEV($M$30:M32)))*SQRT(COUNT($M$30:M32))/(2*(COUNT($M$30:M32)-1)))))))","v":{"$error":"#VALUE!"}},{"$f":"IF((MAX(0,(0.5-(($AL$21-AVERAGE($N$30:N32))/(IF(STDEV($N$30:N32)<0.01,0.01,STDEV($N$30:N32)))*SQRT(COUNT($N$30:N32))/(2*(COUNT($N$30:N32)-1))))))>1,1,(MAX(0,(0.5-(($AL$21-AVERAGE($N$30:N32))/(IF(STDEV($N$30:N32)<0.01,0.01,STDEV($N$30:N32)))*SQRT(COUNT($N$30:N32))/(2*(COUNT($N$30:N32)-1)))))))","v":{"$error":"#VALUE!"}},0,0,0,0,{"$f":"IF((MAX(0,(0.5-(($AQ$21-AVERAGE($S$30:S32))/(IF(STDEV($S$30:S32)<0.01,0.01,STDEV($S$30:S32)))*SQRT(COUNT($S$30:S32))/(2*(COUNT($S$30:S32)-1))))))>1,1,(MAX(0,(0.5-(($AQ$21-AVERAGE($S$30:S32))/(IF(STDEV($S$30:S32)<0.01,0.01,STDEV($S$30:S32)))*SQRT(COUNT($S$30:S32))/(2*(COUNT($S$30:S32)-1)))))))","v":{"$error":"#VALUE!"}},{"$f":"IF((MAX(0,(0.5-(($AR$21-AVERAGE($T$30:T32))/(IF(STDEV($T$30:T32)<0.01,0.01,STDEV($T$30:T32)))*SQRT(COUNT($T$30:T32))/(2*(COUNT($T$30:T32)-1))))))>1,1,(MAX(0,(0.5-(($AR$21-AVERAGE($T$30:T32))/(IF(STDEV($T$30:T32)<0.01,0.01,STDEV($T$30:T32)))*SQRT(COUNT($T$30:T32))/(2*(COUNT($T$30:T32)-1)))))))","v":{"$error":"#VALUE!"}},{"$f":"IF((MAX(0,(0.5-(($AS$21-AVERAGE($AA$30:AA32))/(IF(STDEV($AA$30:AA32)<0.01,0.01,STDEV($AA$30:AA32)))*SQRT(COUNT($AA$30:AA32))/(2*(COUNT($AA$30:AA32)-1))))))>1,1,(MAX(0,(0.5-(($AS$21-AVERAGE($AA$30:AA32))/(IF(STDEV($AA$30:AA32)<0.01,0.01,STDEV($AA$30:AA32)))*SQRT(COUNT($AA$30:AA32))/(2*(COUNT($AA$30:AA32)-1)))))))","v":{"$error":"#DIV/0!"}},{"$f":"IF((MAX(0,(0.5-(($AT$21-AVERAGE($AB$30:AB32))/(IF(STDEV($AB$30:AB32)<0.01,0.01,STDEV($AB$30:AB32)))*SQRT(COUNT($AB$30:AB32))/(2*(COUNT($AB$30:AB32)-1))))))>1,1,(MAX(0,(0.5-(($AT$21-AVERAGE($AB$30:AB32))/(IF(STDEV($AB$30:AB32)<0.01,0.01,STDEV($AB$30:AB32)))*SQRT(COUNT($AB$30:AB32))/(2*(COUNT($AB$30:AB32)-1)))))))","v":{"$error":"#VALUE!"}},null,{"$f":"IF((MAX(0,(0.5-((AVERAGE($M$30:M32)-$AV$22)/(IF(STDEV($M$30:M32)<0.01,0.01,STDEV($M$30:M32)))*SQRT(COUNT($M$30:M32))/(2*(COUNT($M$30:M32)-1))))))>1,1,(MAX(0,(0.5-((AVERAGE($M$30:M32)-$AV$22)/(IF(STDEV($M$30:M32)<0.01,0.01,STDEV($M$30:M32)))*SQRT(COUNT($M$30:M32))/(2*(COUNT($M$30:M32)-1)))))))","v":{"$error":"#DIV/0!"}},{"$f":"IF((MAX(0,(0.5-((AVERAGE($N$30:N32)-$AW$22)/(IF(STDEV($N$30:N32)<0.01,0.01,STDEV($N$30:N32)))*SQRT(COUNT($N$30:N32))/(2*(COUNT($N$30:N32)-1))))))>1,1,(MAX(0,(0.5-((AVERAGE($N$30:N32)-$AW$22)/(IF(STDEV($N$30:N32)<0.01,0.01,STDEV($N$30:N32)))*SQRT(COUNT($N$30:N32))/(2*(COUNT($N$30:N32)-1)))))))","v":{"$error":"#DIV/0!"}},{"$f":"IF((MAX(0,(0.5-((AVERAGE($S$30:S32)-$AX$22)/(IF(STDEV($S$30:S32)<0.01,0.01,STDEV($S$30:S32)))*SQRT(COUNT($S$30:S32))/(2*(COUNT($S$30:S32)-1))))))>1,1,(MAX(0,(0.5-((AVERAGE($S$30:S32)-$AX$22)/(IF(STDEV($S$30:S32)<0.01,0.01,STDEV($S$30:S32)))*SQRT(COUNT($S$30:S32))/(2*(COUNT($S$30:S32)-1)))))))","v":{"$error":"#DIV/0!"}},{"$f":"IF((MAX(0,(0.5-((AVERAGE($T$30:T32)-$AY$22)/(IF(STDEV($T$30:T32)<0.01,0.01,STDEV($T$30:T32)))*SQRT(COUNT($T$30:T32))/(2*(COUNT($T$30:T32)-1))))))>1,1,(MAX(0,(0.5-((AVERAGE($T$30:T32)-$AY$22)/(IF(STDEV($T$30:T32)<0.01,0.01,STDEV($T$30:T32)))*SQRT(COUNT($T$30:T32))/(2*(COUNT($T$30:T32)-1)))))))","v":{"$error":"#DIV/0!"}},{"$f":"IF((MAX(0,(0.5-((AVERAGE($AA$30:AA32)-$AZ$22)/(IF(STDEV($AA$30:AA32)<0.01,0.01,STDEV($AA$30:AA32)))*SQRT(COUNT($AA$30:AA32))/(2*(COUNT($AA$30:AA32)-1))))))>1,1,(MAX(0,(0.5-((AVERAGE($AA$30:AA32)-$AZ$22)/(IF(STDEV($AA$30:AA32)<0.01,0.01,STDEV($AA$30:AA32)))*SQRT(COUNT($AA$30:AA32))/(2*(COUNT($AA$30:AA32)-1)))))))","v":{"$error":"#DIV/0!"}},{"$f":"IF((MAX(0,(0.5-((AVERAGE($AB$30:AB32)-$BA$22)/(IF(STDEV($AB$30:AB32)<0.01,0.01,STDEV($AB$30:AB32)))*SQRT(COUNT($AB$30:AB32))/(2*(COUNT($AB$30:AB32)-1))))))>1,1,(MAX(0,(0.5-((AVERAGE($AB$30:AB32)-$BA$22)/(IF(STDEV($AB$30:AB32)<0.01,0.01,STDEV($AB$30:AB32)))*SQRT(COUNT($AB$30:AB32))/(2*(COUNT($AB$30:AB32)-1)))))))","v":{"$error":"#DIV/0!"}},null,null,{"$f":"(0.5 * ((100-(BETADIST(AK32,((COUNT(M$30:M32))/2)-1,((COUNT(M$30:M32))/2)-1))*100) + (100-(BETADIST(AV32,((COUNT(M$30:M32))/2)-1,((COUNT(M$30:M32))/2)-1))*100) - 100) + 55) / 100","v":{"$error":"#VALUE!"}},{"$f":"(0.5 * ((100-(BETADIST(AL32,((COUNT(N$30:N32))/2)-1,((COUNT(N$30:N32))/2)-1))*100) + (100-(BETADIST(AW32,((COUNT(N$30:N32))/2)-1,((COUNT(N$30:N32))/2)-1))*100) - 100) + 55) / 100","v":{"$error":"#VALUE!"}},{"$f":"(0.5 * ((100-(BETADIST(AQ32,((COUNT(S$30:S32))/2)-1,((COUNT(S$30:S32))/2)-1))*100) + (100-(BETADIST(AX32,((COUNT(S$30:S32))/2)-1,((COUNT(S$30:S32))/2)-1))*100) - 100) + 55) / 100","v":{"$error":"#VALUE!"}},{"$f":"(0.5 * ((100-(BETADIST(AR32,((COUNT(T$30:T32))/2)-1,((COUNT(T$30:T32))/2)-1))*100) + (100-(BETADIST(AY32,((COUNT(T$30:T32))/2)-1,((COUNT(T$30:T32))/2)-1))*100) - 100) + 55) / 100","v":{"$error":"#VALUE!"}},{"$f":"(0.5 * ((100-(BETADIST(AS32,((COUNT(AA$30:AA32))/2)-1,((COUNT(AA$30:AA32))/2)-1))*100) + (100-(BETADIST(AZ32,((COUNT(AA$30:AA32))/2)-1,((COUNT(AA$30:AA32))/2)-1))*100) - 100) + 55) / 100","v":{"$error":"#DIV/0!"}},"No Calc",{"$f":"(BE32*BE$23)+(BF32*BF$23)+(BG32*BG$23)+(BH32*BH$23)+(BD32*BD$23)","v":{"$error":"#VALUE!"}},null,null,null,null,null,null,null,null,null,null,null,null,null,null,null,null,null,null,null,null,null,null,null,null,null,null,null,null,null,null,null,null,null,null,null,null,null,null,null,null,null,null,null,null,null,1,3,"YES",null,null,null,93,null,67,null,40,55,13,null,null,3,5.0999999999999996,97,95,91.5,3.5,3.5,3.6]
[null,null,null,null,null,null,null,null,null,null,null,null,null,null,null,null,null,null,null,null,null,null,null,null,null,null,"","",null,null,0,0,0,0,0,0,{"$f":"IF((MAX(0,(0.5-(($AK$21-AVERAGE($M$30:M33))/(IF(STDEV($M$30:M33)<0.01,0.01,STDEV($M$30:M33)))*SQRT(COUNT($M$30:M33))/(2*(COUNT($M$30:M33)-1))))))>1,1,(MAX(0,(0.5-(($AK$21-AVERAGE($M$30:M33))/(IF(STDEV($M$30:M33)<0.01,0.01,STDEV($M$30:M33)))*SQRT(COUNT($M$30:M33))/(2*(COUNT($M$30:M33)-1)))))))","v":{"$error":"#VALUE!"}},{"$f":"IF((MAX(0,(0.5-(($AL$21-AVERAGE($N$30:N33))/(IF(STDEV($N$30:N33)<0.01,0.01,STDEV($N$30:N33)))*SQRT(COUNT($N$30:N33))/(2*(COUNT($N$30:N33)-1))))))>1,1,(MAX(0,(0.5-(($AL$21-AVERAGE($N$30:N33))/(IF(STDEV($N$30:N33)<0.01,0.01,STDEV($N$30:N33)))*SQRT(COUNT($N$30:N33))/(2*(COUNT($N$30:N33)-1)))))))","v":{"$error":"#VALUE!"}},0,0,0,0,{"$f":"IF((MAX(0,(0.5-(($AQ$21-AVERAGE($S$30:S33))/(IF(STDEV($S$30:S33)<0.01,0.01,STDEV($S$30:S33)))*SQRT(COUNT($S$30:S33))/(2*(COUNT($S$30:S33)-1))))))>1,1,(MAX(0,(0.5-(($AQ$21-AVERAGE($S$30:S33))/(IF(STDEV($S$30:S33)<0.01,0.01,STDEV($S$30:S33)))*SQRT(COUNT($S$30:S33))/(2*(COUNT($S$30:S33)-1)))))))","v":{"$error":"#VALUE!"}},{"$f":"IF((MAX(0,(0.5-(($AR$21-AVERAGE($T$30:T33))/(IF(STDEV($T$30:T33)<0.01,0.01,STDEV($T$30:T33)))*SQRT(COUNT($T$30:T33))/(2*(COUNT($T$30:T33)-1))))))>1,1,(MAX(0,(0.5-(($AR$21-AVERAGE($T$30:T33))/(IF(STDEV($T$30:T33)<0.01,0.01,STDEV($T$30:T33)))*SQRT(COUNT($T$30:T33))/(2*(COUNT($T$30:T33)-1)))))))","v":{"$error":"#VALUE!"}},{"$f":"IF((MAX(0,(0.5-(($AS$21-AVERAGE($AA$30:AA33))/(IF(STDEV($AA$30:AA33)<0.01,0.01,STDEV($AA$30:AA33)))*SQRT(COUNT($AA$30:AA33))/(2*(COUNT($AA$30:AA33)-1))))))>1,1,(MAX(0,(0.5-(($AS$21-AVERAGE($AA$30:AA33))/(IF(STDEV($AA$30:AA33)<0.01,0.01,STDEV($AA$30:AA33)))*SQRT(COUNT($AA$30:AA33))/(2*(COUNT($AA$30:AA33)-1)))))))","v":{"$error":"#DIV/0!"}},{"$f":"IF((MAX(0,(0.5-(($AT$21-AVERAGE($AB$30:AB33))/(IF(STDEV($AB$30:AB33)<0.01,0.01,STDEV($AB$30:AB33)))*SQRT(COUNT($AB$30:AB33))/(2*(COUNT($AB$30:AB33)-1))))))>1,1,(MAX(0,(0.5-(($AT$21-AVERAGE($AB$30:AB33))/(IF(STDEV($AB$30:AB33)<0.01,0.01,STDEV($AB$30:AB33)))*SQRT(COUNT($AB$30:AB33))/(2*(COUNT($AB$30:AB33)-1)))))))","v":{"$error":"#VALUE!"}},null,{"$f":"IF((MAX(0,(0.5-((AVERAGE($M$30:M33)-$AV$22)/(IF(STDEV($M$30:M33)<0.01,0.01,STDEV($M$30:M33)))*SQRT(COUNT($M$30:M33))/(2*(COUNT($M$30:M33)-1))))))>1,1,(MAX(0,(0.5-((AVERAGE($M$30:M33)-$AV$22)/(IF(STDEV($M$30:M33)<0.01,0.01,STDEV($M$30:M33)))*SQRT(COUNT($M$30:M33))/(2*(COUNT($M$30:M33)-1)))))))","v":{"$error":"#DIV/0!"}},{"$f":"IF((MAX(0,(0.5-((AVERAGE($N$30:N33)-$AW$22)/(IF(STDEV($N$30:N33)<0.01,0.01,STDEV($N$30:N33)))*SQRT(COUNT($N$30:N33))/(2*(COUNT($N$30:N33)-1))))))>1,1,(MAX(0,(0.5-((AVERAGE($N$30:N33)-$AW$22)/(IF(STDEV($N$30:N33)<0.01,0.01,STDEV($N$30:N33)))*SQRT(COUNT($N$30:N33))/(2*(COUNT($N$30:N33)-1)))))))","v":{"$error":"#DIV/0!"}},{"$f":"IF((MAX(0,(0.5-((AVERAGE($S$30:S33)-$AX$22)/(IF(STDEV($S$30:S33)<0.01,0.01,STDEV($S$30:S33)))*SQRT(COUNT($S$30:S33))/(2*(COUNT($S$30:S33)-1))))))>1,1,(MAX(0,(0.5-((AVERAGE($S$30:S33)-$AX$22)/(IF(STDEV($S$30:S33)<0.01,0.01,STDEV($S$30:S33)))*SQRT(COUNT($S$30:S33))/(2*(COUNT($S$30:S33)-1)))))))","v":{"$error":"#DIV/0!"}},{"$f":"IF((MAX(0,(0.5-((AVERAGE($T$30:T33)-$AY$22)/(IF(STDEV($T$30:T33)<0.01,0.01,STDEV($T$30:T33)))*SQRT(COUNT($T$30:T33))/(2*(COUNT($T$30:T33)-1))))))>1,1,(MAX(0,(0.5-((AVERAGE($T$30:T33)-$AY$22)/(IF(STDEV($T$30:T33)<0.01,0.01,STDEV($T$30:T33)))*SQRT(COUNT($T$30:T33))/(2*(COUNT($T$30:T33)-1)))))))","v":{"$error":"#DIV/0!"}},{"$f":"IF((MAX(0,(0.5-((AVERAGE($AA$30:AA33)-$AZ$22)/(IF(STDEV($AA$30:AA33)<0.01,0.01,STDEV($AA$30:AA33)))*SQRT(COUNT($AA$30:AA33))/(2*(COUNT($AA$30:AA33)-1))))))>1,1,(MAX(0,(0.5-((AVERAGE($AA$30:AA33)-$AZ$22)/(IF(STDEV($AA$30:AA33)<0.01,0.01,STDEV($AA$30:AA33)))*SQRT(COUNT($AA$30:AA33))/(2*(COUNT($AA$30:AA33)-1)))))))","v":{"$error":"#DIV/0!"}},{"$f":"IF((MAX(0,(0.5-((AVERAGE($AB$30:AB33)-$BA$22)/(IF(STDEV($AB$30:AB33)<0.01,0.01,STDEV($AB$30:AB33)))*SQRT(COUNT($AB$30:AB33))/(2*(COUNT($AB$30:AB33)-1))))))>1,1,(MAX(0,(0.5-((AVERAGE($AB$30:AB33)-$BA$22)/(IF(STDEV($AB$30:AB33)<0.01,0.01,STDEV($AB$30:AB33)))*SQRT(COUNT($AB$30:AB33))/(2*(COUNT($AB$30:AB33)-1)))))))","v":{"$error":"#DIV/0!"}},null,null,{"$f":"(0.5 * ((100-(BETADIST(AK33,((COUNT(M$30:M33))/2)-1,((COUNT(M$30:M33))/2)-1))*100) + (100-(BETADIST(AV33,((COUNT(M$30:M33))/2)-1,((COUNT(M$30:M33))/2)-1))*100) - 100) + 55) / 100","v":{"$error":"#VALUE!"}},{"$f":"(0.5 * ((100-(BETADIST(AL33,((COUNT(N$30:N33))/2)-1,((COUNT(N$30:N33))/2)-1))*100) + (100-(BETADIST(AW33,((COUNT(N$30:N33))/2)-1,((COUNT(N$30:N33))/2)-1))*100) - 100) + 55) / 100","v":{"$error":"#VALUE!"}},{"$f":"(0.5 * ((100-(BETADIST(AQ33,((COUNT(S$30:S33))/2)-1,((COUNT(S$30:S33))/2)-1))*100) + (100-(BETADIST(AX33,((COUNT(S$30:S33))/2)-1,((COUNT(S$30:S33))/2)-1))*100) - 100) + 55) / 100","v":{"$error":"#VALUE!"}},{"$f":"(0.5 * ((100-(BETADIST(AR33,((COUNT(T$30:T33))/2)-1,((COUNT(T$30:T33))/2)-1))*100) + (100-(BETADIST(AY33,((COUNT(T$30:T33))/2)-1,((COUNT(T$30:T33))/2)-1))*100) - 100) + 55) / 100","v":{"$error":"#VALUE!"}},{"$f":"(0.5 * ((100-(BETADIST(AS33,((COUNT(AA$30:AA33))/2)-1,((COUNT(AA$30:AA33))/2)-1))*100) + (100-(BETADIST(AZ33,((COUNT(AA$30:AA33))/2)-1,((COUNT(AA$30:AA33))/2)-1))*100) - 100) + 55) / 100","v":{"$error":"#DIV/0!"}},"No Calc",{"$error":"#VALUE!"},null,null,null,null,null,null,null,null,null,null,null,null,null,null,null,null,null,null,null,null,null,null,null,null,null,null,null,null,null,null,null,null,null,null,null,null,null,null,null,null,null,null,3,null,null,1,4,"YES",null,null,null,92,null,68,null,40,92,14,null,null,5.0999999999999996,5.4,92.3,95.2,95.2]
[null,null,null,null,null,null,null,null,null,null,null,null,null,null,null,null,null,null,null,null,null,null,null,null,null,null,"","",null,null,0,0,0,0,0,0,{"$f":"IF((MAX(0,(0.5-(($AK$21-AVERAGE($M$30:M34))/(IF(STDEV($M$30:M34)<0.01,0.01,STDEV($M$30:M34)))*SQRT(COUNT($M$30:M34))/(2*(COUNT($M$30:M34)-1))))))>1,1,(MAX(0,(0.5-(($AK$21-AVERAGE($M$30:M34))/(IF(STDEV($M$30:M34)<0.01,0.01,STDEV($M$30:M34)))*SQRT(COUNT($M$30:M34))/(2*(COUNT($M$30:M34)-1)))))))","v":{"$error":"#VALUE!"}},{"$f":"IF((MAX(0,(0.5-(($AL$21-AVERAGE($N$30:N34))/(IF(STDEV($N$30:N34)<0.01,0.01,STDEV($N$30:N34)))*SQRT(COUNT($N$30:N34))/(2*(COUNT($N$30:N34)-1))))))>1,1,(MAX(0,(0.5-(($AL$21-AVERAGE($N$30:N34))/(IF(STDEV($N$30:N34)<0.01,0.01,STDEV($N$30:N34)))*SQRT(COUNT($N$30:N34))/(2*(COUNT($N$30:N34)-1)))))))","v":{"$error":"#VALUE!"}},0,0,0,0,{"$f":"IF((MAX(0,(0.5-(($AQ$21-AVERAGE($S$30:S34))/(IF(STDEV($S$30:S34)<0.01,0.01,STDEV($S$30:S34)))*SQRT(COUNT($S$30:S34))/(2*(COUNT($S$30:S34)-1))))))>1,1,(MAX(0,(0.5-(($AQ$21-AVERAGE($S$30:S34))/(IF(STDEV($S$30:S34)<0.01,0.01,STDEV($S$30:S34)))*SQRT(COUNT($S$30:S34))/(2*(COUNT($S$30:S34)-1)))))))","v":{"$error":"#VALUE!"}},{"$f":"IF((MAX(0,(0.5-(($AR$21-AVERAGE($T$30:T34))/(IF(STDEV($T$30:T34)<0.01,0.01,STDEV($T$30:T34)))*SQRT(COUNT($T$30:T34))/(2*(COUNT($T$30:T34)-1))))))>1,1,(MAX(0,(0.5-(($AR$21-AVERAGE($T$30:T34))/(IF(STDEV($T$30:T34)<0.01,0.01,STDEV($T$30:T34)))*SQRT(COUNT($T$30:T34))/(2*(COUNT($T$30:T34)-1)))))))","v":{"$error":"#VALUE!"}},{"$f":"IF((MAX(0,(0.5-(($AS$21-AVERAGE($AA$30:AA34))/(IF(STDEV($AA$30:AA34)<0.01,0.01,STDEV($AA$30:AA34)))*SQRT(COUNT($AA$30:AA34))/(2*(COUNT($AA$30:AA34)-1))))))>1,1,(MAX(0,(0.5-(($AS$21-AVERAGE($AA$30:AA34))/(IF(STDEV($AA$30:AA34)<0.01,0.01,STDEV($AA$30:AA34)))*SQRT(COUNT($AA$30:AA34))/(2*(COUNT($AA$30:AA34)-1)))))))","v":{"$error":"#DIV/0!"}},{"$f":"IF((MAX(0,(0.5-(($AT$21-AVERAGE($AB$30:AB34))/(IF(STDEV($AB$30:AB34)<0.01,0.01,STDEV($AB$30:AB34)))*SQRT(COUNT($AB$30:AB34))/(2*(COUNT($AB$30:AB34)-1))))))>1,1,(MAX(0,(0.5-(($AT$21-AVERAGE($AB$30:AB34))/(IF(STDEV($AB$30:AB34)<0.01,0.01,STDEV($AB$30:AB34)))*SQRT(COUNT($AB$30:AB34))/(2*(COUNT($AB$30:AB34)-1)))))))","v":{"$error":"#VALUE!"}},null,{"$f":"IF((MAX(0,(0.5-((AVERAGE($M$30:M34)-$AV$22)/(IF(STDEV($M$30:M34)<0.01,0.01,STDEV($M$30:M34)))*SQRT(COUNT($M$30:M34))/(2*(COUNT($M$30:M34)-1))))))>1,1,(MAX(0,(0.5-((AVERAGE($M$30:M34)-$AV$22)/(IF(STDEV($M$30:M34)<0.01,0.01,STDEV($M$30:M34)))*SQRT(COUNT($M$30:M34))/(2*(COUNT($M$30:M34)-1)))))))","v":{"$error":"#DIV/0!"}},{"$f":"IF((MAX(0,(0.5-((AVERAGE($N$30:N34)-$AW$22)/(IF(STDEV($N$30:N34)<0.01,0.01,STDEV($N$30:N34)))*SQRT(COUNT($N$30:N34))/(2*(COUNT($N$30:N34)-1))))))>1,1,(MAX(0,(0.5-((AVERAGE($N$30:N34)-$AW$22)/(IF(STDEV($N$30:N34)<0.01,0.01,STDEV($N$30:N34)))*SQRT(COUNT($N$30:N34))/(2*(COUNT($N$30:N34)-1)))))))","v":{"$error":"#DIV/0!"}},{"$f":"IF((MAX(0,(0.5-((AVERAGE($S$30:S34)-$AX$22)/(IF(STDEV($S$30:S34)<0.01,0.01,STDEV($S$30:S34)))*SQRT(COUNT($S$30:S34))/(2*(COUNT($S$30:S34)-1))))))>1,1,(MAX(0,(0.5-((AVERAGE($S$30:S34)-$AX$22)/(IF(STDEV($S$30:S34)<0.01,0.01,STDEV($S$30:S34)))*SQRT(COUNT($S$30:S34))/(2*(COUNT($S$30:S34)-1)))))))","v":{"$error":"#DIV/0!"}},{"$f":"IF((MAX(0,(0.5-((AVERAGE($T$30:T34)-$AY$22)/(IF(STDEV($T$30:T34)<0.01,0.01,STDEV($T$30:T34)))*SQRT(COUNT($T$30:T34))/(2*(COUNT($T$30:T34)-1))))))>1,1,(MAX(0,(0.5-((AVERAGE($T$30:T34)-$AY$22)/(IF(STDEV($T$30:T34)<0.01,0.01,STDEV($T$30:T34)))*SQRT(COUNT($T$30:T34))/(2*(COUNT($T$30:T34)-1)))))))","v":{"$error":"#DIV/0!"}},{"$f":"IF((MAX(0,(0.5-((AVERAGE($AA$30:AA34)-$AZ$22)/(IF(STDEV($AA$30:AA34)<0.01,0.01,STDEV($AA$30:AA34)))*SQRT(COUNT($AA$30:AA34))/(2*(COUNT($AA$30:AA34)-1))))))>1,1,(MAX(0,(0.5-((AVERAGE($AA$30:AA34)-$AZ$22)/(IF(STDEV($AA$30:AA34)<0.01,0.01,STDEV($AA$30:AA34)))*SQRT(COUNT($AA$30:AA34))/(2*(COUNT($AA$30:AA34)-1)))))))","v":{"$error":"#DIV/0!"}},{"$f":"IF((MAX(0,(0.5-((AVERAGE($AB$30:AB34)-$BA$22)/(IF(STDEV($AB$30:AB34)<0.01,0.01,STDEV($AB$30:AB34)))*SQRT(COUNT($AB$30:AB34))/(2*(COUNT($AB$30:AB34)-1))))))>1,1,(MAX(0,(0.5-((AVERAGE($AB$30:AB34)-$BA$22)/(IF(STDEV($AB$30:AB34)<0.01,0.01,STDEV($AB$30:AB34)))*SQRT(COUNT($AB$30:AB34))/(2*(COUNT($AB$30:AB34)-1)))))))","v":{"$error":"#DIV/0!"}},null,null,{"$f":"(0.5 * ((100-(BETADIST(AK34,((COUNT(M$30:M34))/2)-1,((COUNT(M$30:M34))/2)-1))*100) + (100-(BETADIST(AV34,((COUNT(M$30:M34))/2)-1,((COUNT(M$30:M34))/2)-1))*100) - 100) + 55) / 100","v":{"$error":"#VALUE!"}},{"$f":"(0.5 * ((100-(BETADIST(AL34,((COUNT(N$30:N34))/2)-1,((COUNT(N$30:N34))/2)-1))*100) + (100-(BETADIST(AW34,((COUNT(N$30:N34))/2)-1,((COUNT(N$30:N34))/2)-1))*100) - 100) + 55) / 100","v":{"$error":"#VALUE!"}},{"$f":"(0.5 * ((100-(BETADIST(AQ34,((COUNT(S$30:S34))/2)-1,((COUNT(S$30:S34))/2)-1))*100) + (100-(BETADIST(AX34,((COUNT(S$30:S34))/2)-1,((COUNT(S$30:S34))/2)-1))*100) - 100) + 55) / 100","v":{"$error":"#VALUE!"}},{"$f":"(0.5 * ((100-(BETADIST(AR34,((COUNT(T$30:T34))/2)-1,((COUNT(T$30:T34))/2)-1))*100) + (100-(BETADIST(AY34,((COUNT(T$30:T34))/2)-1,((COUNT(T$30:T34))/2)-1))*100) - 100) + 55) / 100","v":{"$error":"#VALUE!"}},{"$f":"(0.5 * ((100-(BETADIST(AS34,((COUNT(AA$30:AA34))/2)-1,((COUNT(AA$30:AA34))/2)-1))*100) + (100-(BETADIST(AZ34,((COUNT(AA$30:AA34))/2)-1,((COUNT(AA$30:AA34))/2)-1))*100) - 100) + 55) / 100","v":{"$error":"#DIV/0!"}},{"$f":"(0.5 * ((100-(BETADIST(AT34,((COUNT(AB$30:AB34))/2)-1,((COUNT(AB$30:AB34))/2)-1))*100) + (100-(BETADIST(BA34,((COUNT(AB$30:AB34))/2)-1,((COUNT(AB$30:AB34))/2)-1))*100) - 100) + 55) / 100","v":{"$error":"#VALUE!"}},{"$error":"#VALUE!"},null,null,null,null,null,null,null,null,null,null,null,null,null,null,null,null,null,null,null,null,null,null,null,null,null,null,null,null,null,null,null,null,null,null,null,null,null,null,null,null,null,null,null,"2008-11-12",null,1,5,null,null,null,null,91,null,69,null,33,22,15,null,null,4.8,5.2,93.1,93.2,93.3,3.6,3.7,3.8]
[null,null,null,null,null,null,null,null,null,null,null,null,null,null,null,null,null,null,null,null,null,null,null,null,null,null,"","",null,null,0,0,0,0,0,0,{"$f":"IF((MAX(0,(0.5-(($AK$21-AVERAGE($M$30:M35))/(IF(STDEV($M$30:M35)<0.01,0.01,STDEV($M$30:M35)))*SQRT(COUNT($M$30:M35))/(2*(COUNT($M$30:M35)-1))))))>1,1,(MAX(0,(0.5-(($AK$21-AVERAGE($M$30:M35))/(IF(STDEV($M$30:M35)<0.01,0.01,STDEV($M$30:M35)))*SQRT(COUNT($M$30:M35))/(2*(COUNT($M$30:M35)-1)))))))","v":{"$error":"#VALUE!"}},{"$f":"IF((MAX(0,(0.5-(($AL$21-AVERAGE($N$30:N35))/(IF(STDEV($N$30:N35)<0.01,0.01,STDEV($N$30:N35)))*SQRT(COUNT($N$30:N35))/(2*(COUNT($N$30:N35)-1))))))>1,1,(MAX(0,(0.5-(($AL$21-AVERAGE($N$30:N35))/(IF(STDEV($N$30:N35)<0.01,0.01,STDEV($N$30:N35)))*SQRT(COUNT($N$30:N35))/(2*(COUNT($N$30:N35)-1)))))))","v":{"$error":"#VALUE!"}},0,0,0,0,{"$f":"IF((MAX(0,(0.5-(($AQ$21-AVERAGE($S$30:S35))/(IF(STDEV($S$30:S35)<0.01,0.01,STDEV($S$30:S35)))*SQRT(COUNT($S$30:S35))/(2*(COUNT($S$30:S35)-1))))))>1,1,(MAX(0,(0.5-(($AQ$21-AVERAGE($S$30:S35))/(IF(STDEV($S$30:S35)<0.01,0.01,STDEV($S$30:S35)))*SQRT(COUNT($S$30:S35))/(2*(COUNT($S$30:S35)-1)))))))","v":{"$error":"#VALUE!"}},{"$f":"IF((MAX(0,(0.5-(($AR$21-AVERAGE($T$30:T35))/(IF(STDEV($T$30:T35)<0.01,0.01,STDEV($T$30:T35)))*SQRT(COUNT($T$30:T35))/(2*(COUNT($T$30:T35)-1))))))>1,1,(MAX(0,(0.5-(($AR$21-AVERAGE($T$30:T35))/(IF(STDEV($T$30:T35)<0.01,0.01,STDEV($T$30:T35)))*SQRT(COUNT($T$30:T35))/(2*(COUNT($T$30:T35)-1)))))))","v":{"$error":"#VALUE!"}},{"$f":"IF((MAX(0,(0.5-(($AS$21-AVERAGE($AA$30:AA35))/(IF(STDEV($AA$30:AA35)<0.01,0.01,STDEV($AA$30:AA35)))*SQRT(COUNT($AA$30:AA35))/(2*(COUNT($AA$30:AA35)-1))))))>1,1,(MAX(0,(0.5-(($AS$21-AVERAGE($AA$30:AA35))/(IF(STDEV($AA$30:AA35)<0.01,0.01,STDEV($AA$30:AA35)))*SQRT(COUNT($AA$30:AA35))/(2*(COUNT($AA$30:AA35)-1)))))))","v":{"$error":"#DIV/0!"}},{"$f":"IF((MAX(0,(0.5-(($AT$21-AVERAGE($AB$30:AB35))/(IF(STDEV($AB$30:AB35)<0.01,0.01,STDEV($AB$30:AB35)))*SQRT(COUNT($AB$30:AB35))/(2*(COUNT($AB$30:AB35)-1))))))>1,1,(MAX(0,(0.5-(($AT$21-AVERAGE($AB$30:AB35))/(IF(STDEV($AB$30:AB35)<0.01,0.01,STDEV($AB$30:AB35)))*SQRT(COUNT($AB$30:AB35))/(2*(COUNT($AB$30:AB35)-1)))))))","v":{"$error":"#VALUE!"}},null,{"$f":"IF((MAX(0,(0.5-((AVERAGE($M$30:M35)-$AV$22)/(IF(STDEV($M$30:M35)<0.01,0.01,STDEV($M$30:M35)))*SQRT(COUNT($M$30:M35))/(2*(COUNT($M$30:M35)-1))))))>1,1,(MAX(0,(0.5-((AVERAGE($M$30:M35)-$AV$22)/(IF(STDEV($M$30:M35)<0.01,0.01,STDEV($M$30:M35)))*SQRT(COUNT($M$30:M35))/(2*(COUNT($M$30:M35)-1)))))))","v":{"$error":"#DIV/0!"}},{"$f":"IF((MAX(0,(0.5-((AVERAGE($N$30:N35)-$AW$22)/(IF(STDEV($N$30:N35)<0.01,0.01,STDEV($N$30:N35)))*SQRT(COUNT($N$30:N35))/(2*(COUNT($N$30:N35)-1))))))>1,1,(MAX(0,(0.5-((AVERAGE($N$30:N35)-$AW$22)/(IF(STDEV($N$30:N35)<0.01,0.01,STDEV($N$30:N35)))*SQRT(COUNT($N$30:N35))/(2*(COUNT($N$30:N35)-1)))))))","v":{"$error":"#DIV/0!"}},{"$f":"IF((MAX(0,(0.5-((AVERAGE($S$30:S35)-$AX$22)/(IF(STDEV($S$30:S35)<0.01,0.01,STDEV($S$30:S35)))*SQRT(COUNT($S$30:S35))/(2*(COUNT($S$30:S35)-1))))))>1,1,(MAX(0,(0.5-((AVERAGE($S$30:S35)-$AX$22)/(IF(STDEV($S$30:S35)<0.01,0.01,STDEV($S$30:S35)))*SQRT(COUNT($S$30:S35))/(2*(COUNT($S$30:S35)-1)))))))","v":{"$error":"#DIV/0!"}},{"$f":"IF((MAX(0,(0.5-((AVERAGE($T$30:T35)-$AY$22)/(IF(STDEV($T$30:T35)<0.01,0.01,STDEV($T$30:T35)))*SQRT(COUNT($T$30:T35))/(2*(COUNT($T$30:T35)-1))))))>1,1,(MAX(0,(0.5-((AVERAGE($T$30:T35)-$AY$22)/(IF(STDEV($T$30:T35)<0.01,0.01,STDEV($T$30:T35)))*SQRT(COUNT($T$30:T35))/(2*(COUNT($T$30:T35)-1)))))))","v":{"$error":"#DIV/0!"}},{"$f":"IF((MAX(0,(0.5-((AVERAGE($AA$30:AA35)-$AZ$22)/(IF(STDEV($AA$30:AA35)<0.01,0.01,STDEV($AA$30:AA35)))*SQRT(COUNT($AA$30:AA35))/(2*(COUNT($AA$30:AA35)-1))))))>1,1,(MAX(0,(0.5-((AVERAGE($AA$30:AA35)-$AZ$22)/(IF(STDEV($AA$30:AA35)<0.01,0.01,STDEV($AA$30:AA35)))*SQRT(COUNT($AA$30:AA35))/(2*(COUNT($AA$30:AA35)-1)))))))","v":{"$error":"#DIV/0!"}},{"$f":"IF((MAX(0,(0.5-((AVERAGE($AB$30:AB35)-$BA$22)/(IF(STDEV($AB$30:AB35)<0.01,0.01,STDEV($AB$30:AB35)))*SQRT(COUNT($AB$30:AB35))/(2*(COUNT($AB$30:AB35)-1))))))>1,1,(MAX(0,(0.5-((AVERAGE($AB$30:AB35)-$BA$22)/(IF(STDEV($AB$30:AB35)<0.01,0.01,STDEV($AB$30:AB35)))*SQRT(COUNT($AB$30:AB35))/(2*(COUNT($AB$30:AB35)-1)))))))","v":{"$error":"#DIV/0!"}},null,null,{"$f":"(0.5 * ((100-(BETADIST(AK35,((COUNT(M$30:M35))/2)-1,((COUNT(M$30:M35))/2)-1))*100) + (100-(BETADIST(AV35,((COUNT(M$30:M35))/2)-1,((COUNT(M$30:M35))/2)-1))*100) - 100) + 55) / 100","v":{"$error":"#VALUE!"}},{"$f":"(0.5 * ((100-(BETADIST(AL35,((COUNT(N$30:N35))/2)-1,((COUNT(N$30:N35))/2)-1))*100) + (100-(BETADIST(AW35,((COUNT(N$30:N35))/2)-1,((COUNT(N$30:N35))/2)-1))*100) - 100) + 55) / 100","v":{"$error":"#VALUE!"}},{"$f":"(0.5 * ((100-(BETADIST(AQ35,((COUNT(S$30:S35))/2)-1,((COUNT(S$30:S35))/2)-1))*100) + (100-(BETADIST(AX35,((COUNT(S$30:S35))/2)-1,((COUNT(S$30:S35))/2)-1))*100) - 100) + 55) / 100","v":{"$error":"#VALUE!"}},{"$f":"(0.5 * ((100-(BETADIST(AR35,((COUNT(T$30:T35))/2)-1,((COUNT(T$30:T35))/2)-1))*100) + (100-(BETADIST(AY35,((COUNT(T$30:T35))/2)-1,((COUNT(T$30:T35))/2)-1))*100) - 100) + 55) / 100","v":{"$error":"#VALUE!"}},{"$f":"(0.5 * ((100-(BETADIST(AS35,((COUNT(AA$30:AA35))/2)-1,((COUNT(AA$30:AA35))/2)-1))*100) + (100-(BETADIST(AZ35,((COUNT(AA$30:AA35))/2)-1,((COUNT(AA$30:AA35))/2)-1))*100) - 100) + 55) / 100","v":{"$error":"#DIV/0!"}},{"$f":"(0.5 * ((100-(BETADIST(AT35,((COUNT(AB$30:AB35))/2)-1,((COUNT(AB$30:AB35))/2)-1))*100) + (100-(BETADIST(BA35,((COUNT(AB$30:AB35))/2)-1,((COUNT(AB$30:AB35))/2)-1))*100) - 100) + 55) / 100","v":{"$error":"#VALUE!"}},{"$error":"#VALUE!"},null,null,null,null,null,null,null,null,null,null,null,null,null,null,null,null,null,null,null,null,null,null,null,null,null,null,null,null,null,null,null,null,null,null,null,null,null,null,null,null,null,null,null,"2009-07-16",null,1,6,"YES",null,null,null,90,null,70,null,40,null,16,null,null,6.8,5.09,95.1,95.2,95.2]
[null,null,null,null,null,null,null,null,null,null,null,null,null,null,null,null,null,null,null,null,null,null,null,null,null,null,"","",null,null,0,0,0,0,0,0,{"$f":"IF((MAX(0,(0.5-(($AK$21-AVERAGE($M$30:M36))/(IF(STDEV($M$30:M36)<0.01,0.01,STDEV($M$30:M36)))*SQRT(COUNT($M$30:M36))/(2*(COUNT($M$30:M36)-1))))))>1,1,(MAX(0,(0.5-(($AK$21-AVERAGE($M$30:M36))/(IF(STDEV($M$30:M36)<0.01,0.01,STDEV($M$30:M36)))*SQRT(COUNT($M$30:M36))/(2*(COUNT($M$30:M36)-1)))))))","v":{"$error":"#VALUE!"}},{"$f":"IF((MAX(0,(0.5-(($AL$21-AVERAGE($N$30:N36))/(IF(STDEV($N$30:N36)<0.01,0.01,STDEV($N$30:N36)))*SQRT(COUNT($N$30:N36))/(2*(COUNT($N$30:N36)-1))))))>1,1,(MAX(0,(0.5-(($AL$21-AVERAGE($N$30:N36))/(IF(STDEV($N$30:N36)<0.01,0.01,STDEV($N$30:N36)))*SQRT(COUNT($N$30:N36))/(2*(COUNT($N$30:N36)-1)))))))","v":{"$error":"#VALUE!"}},0,0,0,0,{"$f":"IF((MAX(0,(0.5-(($AQ$21-AVERAGE($S$30:S36))/(IF(STDEV($S$30:S36)<0.01,0.01,STDEV($S$30:S36)))*SQRT(COUNT($S$30:S36))/(2*(COUNT($S$30:S36)-1))))))>1,1,(MAX(0,(0.5-(($AQ$21-AVERAGE($S$30:S36))/(IF(STDEV($S$30:S36)<0.01,0.01,STDEV($S$30:S36)))*SQRT(COUNT($S$30:S36))/(2*(COUNT($S$30:S36)-1)))))))","v":{"$error":"#VALUE!"}},{"$f":"IF((MAX(0,(0.5-(($AR$21-AVERAGE($T$30:T36))/(IF(STDEV($T$30:T36)<0.01,0.01,STDEV($T$30:T36)))*SQRT(COUNT($T$30:T36))/(2*(COUNT($T$30:T36)-1))))))>1,1,(MAX(0,(0.5-(($AR$21-AVERAGE($T$30:T36))/(IF(STDEV($T$30:T36)<0.01,0.01,STDEV($T$30:T36)))*SQRT(COUNT($T$30:T36))/(2*(COUNT($T$30:T36)-1)))))))","v":{"$error":"#VALUE!"}},{"$f":"IF((MAX(0,(0.5-(($AS$21-AVERAGE($AA$30:AA36))/(IF(STDEV($AA$30:AA36)<0.01,0.01,STDEV($AA$30:AA36)))*SQRT(COUNT($AA$30:AA36))/(2*(COUNT($AA$30:AA36)-1))))))>1,1,(MAX(0,(0.5-(($AS$21-AVERAGE($AA$30:AA36))/(IF(STDEV($AA$30:AA36)<0.01,0.01,STDEV($AA$30:AA36)))*SQRT(COUNT($AA$30:AA36))/(2*(COUNT($AA$30:AA36)-1)))))))","v":{"$error":"#DIV/0!"}},{"$f":"IF((MAX(0,(0.5-(($AT$21-AVERAGE($AB$30:AB36))/(IF(STDEV($AB$30:AB36)<0.01,0.01,STDEV($AB$30:AB36)))*SQRT(COUNT($AB$30:AB36))/(2*(COUNT($AB$30:AB36)-1))))))>1,1,(MAX(0,(0.5-(($AT$21-AVERAGE($AB$30:AB36))/(IF(STDEV($AB$30:AB36)<0.01,0.01,STDEV($AB$30:AB36)))*SQRT(COUNT($AB$30:AB36))/(2*(COUNT($AB$30:AB36)-1)))))))","v":{"$error":"#VALUE!"}},null,{"$f":"IF((MAX(0,(0.5-((AVERAGE($M$30:M36)-$AV$22)/(IF(STDEV($M$30:M36)<0.01,0.01,STDEV($M$30:M36)))*SQRT(COUNT($M$30:M36))/(2*(COUNT($M$30:M36)-1))))))>1,1,(MAX(0,(0.5-((AVERAGE($M$30:M36)-$AV$22)/(IF(STDEV($M$30:M36)<0.01,0.01,STDEV($M$30:M36)))*SQRT(COUNT($M$30:M36))/(2*(COUNT($M$30:M36)-1)))))))","v":{"$error":"#DIV/0!"}},{"$f":"IF((MAX(0,(0.5-((AVERAGE($N$30:N36)-$AW$22)/(IF(STDEV($N$30:N36)<0.01,0.01,STDEV($N$30:N36)))*SQRT(COUNT($N$30:N36))/(2*(COUNT($N$30:N36)-1))))))>1,1,(MAX(0,(0.5-((AVERAGE($N$30:N36)-$AW$22)/(IF(STDEV($N$30:N36)<0.01,0.01,STDEV($N$30:N36)))*SQRT(COUNT($N$30:N36))/(2*(COUNT($N$30:N36)-1)))))))","v":{"$error":"#DIV/0!"}},{"$f":"IF((MAX(0,(0.5-((AVERAGE($S$30:S36)-$AX$22)/(IF(STDEV($S$30:S36)<0.01,0.01,STDEV($S$30:S36)))*SQRT(COUNT($S$30:S36))/(2*(COUNT($S$30:S36)-1))))))>1,1,(MAX(0,(0.5-((AVERAGE($S$30:S36)-$AX$22)/(IF(STDEV($S$30:S36)<0.01,0.01,STDEV($S$30:S36)))*SQRT(COUNT($S$30:S36))/(2*(COUNT($S$30:S36)-1)))))))","v":{"$error":"#DIV/0!"}},{"$f":"IF((MAX(0,(0.5-((AVERAGE($T$30:T36)-$AY$22)/(IF(STDEV($T$30:T36)<0.01,0.01,STDEV($T$30:T36)))*SQRT(COUNT($T$30:T36))/(2*(COUNT($T$30:T36)-1))))))>1,1,(MAX(0,(0.5-((AVERAGE($T$30:T36)-$AY$22)/(IF(STDEV($T$30:T36)<0.01,0.01,STDEV($T$30:T36)))*SQRT(COUNT($T$30:T36))/(2*(COUNT($T$30:T36)-1)))))))","v":{"$error":"#DIV/0!"}},{"$f":"IF((MAX(0,(0.5-((AVERAGE($AA$30:AA36)-$AZ$22)/(IF(STDEV($AA$30:AA36)<0.01,0.01,STDEV($AA$30:AA36)))*SQRT(COUNT($AA$30:AA36))/(2*(COUNT($AA$30:AA36)-1))))))>1,1,(MAX(0,(0.5-((AVERAGE($AA$30:AA36)-$AZ$22)/(IF(STDEV($AA$30:AA36)<0.01,0.01,STDEV($AA$30:AA36)))*SQRT(COUNT($AA$30:AA36))/(2*(COUNT($AA$30:AA36)-1)))))))","v":{"$error":"#DIV/0!"}},{"$f":"IF((MAX(0,(0.5-((AVERAGE($AB$30:AB36)-$BA$22)/(IF(STDEV($AB$30:AB36)<0.01,0.01,STDEV($AB$30:AB36)))*SQRT(COUNT($AB$30:AB36))/(2*(COUNT($AB$30:AB36)-1))))))>1,1,(MAX(0,(0.5-((AVERAGE($AB$30:AB36)-$BA$22)/(IF(STDEV($AB$30:AB36)<0.01,0.01,STDEV($AB$30:AB36)))*SQRT(COUNT($AB$30:AB36))/(2*(COUNT($AB$30:AB36)-1)))))))","v":{"$error":"#DIV/0!"}},null,null,{"$f":"(0.5 * ((100-(BETADIST(AK36,((COUNT(M$30:M36))/2)-1,((COUNT(M$30:M36))/2)-1))*100) + (100-(BETADIST(AV36,((COUNT(M$30:M36))/2)-1,((COUNT(M$30:M36))/2)-1))*100) - 100) + 55) / 100","v":{"$error":"#VALUE!"}},{"$f":"(0.5 * ((100-(BETADIST(AL36,((COUNT(N$30:N36))/2)-1,((COUNT(N$30:N36))/2)-1))*100) + (100-(BETADIST(AW36,((COUNT(N$30:N36))/2)-1,((COUNT(N$30:N36))/2)-1))*100) - 100) + 55) / 100","v":{"$error":"#VALUE!"}},{"$f":"(0.5 * ((100-(BETADIST(AQ36,((COUNT(S$30:S36))/2)-1,((COUNT(S$30:S36))/2)-1))*100) + (100-(BETADIST(AX36,((COUNT(S$30:S36))/2)-1,((COUNT(S$30:S36))/2)-1))*100) - 100) + 55) / 100","v":{"$error":"#VALUE!"}},{"$f":"(0.5 * ((100-(BETADIST(AR36,((COUNT(T$30:T36))/2)-1,((COUNT(T$30:T36))/2)-1))*100) + (100-(BETADIST(AY36,((COUNT(T$30:T36))/2)-1,((COUNT(T$30:T36))/2)-1))*100) - 100) + 55) / 100","v":{"$error":"#VALUE!"}},{"$f":"(0.5 * ((100-(BETADIST(AS36,((COUNT(AA$30:AA36))/2)-1,((COUNT(AA$30:AA36))/2)-1))*100) + (100-(BETADIST(AZ36,((COUNT(AA$30:AA36))/2)-1,((COUNT(AA$30:AA36))/2)-1))*100) - 100) + 55) / 100","v":{"$error":"#DIV/0!"}},{"$f":"(0.5 * ((100-(BETADIST(AT36,((COUNT(AB$30:AB36))/2)-1,((COUNT(AB$30:AB36))/2)-1))*100) + (100-(BETADIST(BA36,((COUNT(AB$30:AB36))/2)-1,((COUNT(AB$30:AB36))/2)-1))*100) - 100) + 55) / 100","v":{"$error":"#VALUE!"}},{"$error":"#VALUE!"},null,null,null,null,null,null,null,null,null,null,null,null,null,null,null,null,null,null,null,null,null,null,null,null,null,null,null,null,null,null,null,null,null,null,null,null,null,null,null,null,null,null,null,null,null,1,7,"NO",null,null,null,89,null,71,null,40,null,17,null,null,5.8,5.04,94.1,94.2,94.1,4.0999999999999996,4.2,4.3]
[null,null,null,null,null,null,null,null,null,null,null,null,null,null,null,null,null,null,null,null,null,null,null,null,null,null,"","",null,null,0,0,0,0,0,0,{"$f":"IF((MAX(0,(0.5-(($AK$21-AVERAGE($M$30:M37))/(IF(STDEV($M$30:M37)<0.01,0.01,STDEV($M$30:M37)))*SQRT(COUNT($M$30:M37))/(2*(COUNT($M$30:M37)-1))))))>1,1,(MAX(0,(0.5-(($AK$21-AVERAGE($M$30:M37))/(IF(STDEV($M$30:M37)<0.01,0.01,STDEV($M$30:M37)))*SQRT(COUNT($M$30:M37))/(2*(COUNT($M$30:M37)-1)))))))","v":{"$error":"#VALUE!"}},{"$f":"IF((MAX(0,(0.5-(($AL$21-AVERAGE($N$30:N37))/(IF(STDEV($N$30:N37)<0.01,0.01,STDEV($N$30:N37)))*SQRT(COUNT($N$30:N37))/(2*(COUNT($N$30:N37)-1))))))>1,1,(MAX(0,(0.5-(($AL$21-AVERAGE($N$30:N37))/(IF(STDEV($N$30:N37)<0.01,0.01,STDEV($N$30:N37)))*SQRT(COUNT($N$30:N37))/(2*(COUNT($N$30:N37)-1)))))))","v":{"$error":"#VALUE!"}},0,0,0,0,{"$f":"IF((MAX(0,(0.5-(($AQ$21-AVERAGE($S$30:S37))/(IF(STDEV($S$30:S37)<0.01,0.01,STDEV($S$30:S37)))*SQRT(COUNT($S$30:S37))/(2*(COUNT($S$30:S37)-1))))))>1,1,(MAX(0,(0.5-(($AQ$21-AVERAGE($S$30:S37))/(IF(STDEV($S$30:S37)<0.01,0.01,STDEV($S$30:S37)))*SQRT(COUNT($S$30:S37))/(2*(COUNT($S$30:S37)-1)))))))","v":{"$error":"#VALUE!"}},{"$f":"IF((MAX(0,(0.5-(($AR$21-AVERAGE($T$30:T37))/(IF(STDEV($T$30:T37)<0.01,0.01,STDEV($T$30:T37)))*SQRT(COUNT($T$30:T37))/(2*(COUNT($T$30:T37)-1))))))>1,1,(MAX(0,(0.5-(($AR$21-AVERAGE($T$30:T37))/(IF(STDEV($T$30:T37)<0.01,0.01,STDEV($T$30:T37)))*SQRT(COUNT($T$30:T37))/(2*(COUNT($T$30:T37)-1)))))))","v":{"$error":"#VALUE!"}},{"$f":"IF((MAX(0,(0.5-(($AS$21-AVERAGE($AA$30:AA37))/(IF(STDEV($AA$30:AA37)<0.01,0.01,STDEV($AA$30:AA37)))*SQRT(COUNT($AA$30:AA37))/(2*(COUNT($AA$30:AA37)-1))))))>1,1,(MAX(0,(0.5-(($AS$21-AVERAGE($AA$30:AA37))/(IF(STDEV($AA$30:AA37)<0.01,0.01,STDEV($AA$30:AA37)))*SQRT(COUNT($AA$30:AA37))/(2*(COUNT($AA$30:AA37)-1)))))))","v":{"$error":"#DIV/0!"}},{"$f":"IF((MAX(0,(0.5-(($AT$21-AVERAGE($AB$30:AB37))/(IF(STDEV($AB$30:AB37)<0.01,0.01,STDEV($AB$30:AB37)))*SQRT(COUNT($AB$30:AB37))/(2*(COUNT($AB$30:AB37)-1))))))>1,1,(MAX(0,(0.5-(($AT$21-AVERAGE($AB$30:AB37))/(IF(STDEV($AB$30:AB37)<0.01,0.01,STDEV($AB$30:AB37)))*SQRT(COUNT($AB$30:AB37))/(2*(COUNT($AB$30:AB37)-1)))))))","v":{"$error":"#VALUE!"}},null,{"$f":"IF((MAX(0,(0.5-((AVERAGE($M$30:M37)-$AV$22)/(IF(STDEV($M$30:M37)<0.01,0.01,STDEV($M$30:M37)))*SQRT(COUNT($M$30:M37))/(2*(COUNT($M$30:M37)-1))))))>1,1,(MAX(0,(0.5-((AVERAGE($M$30:M37)-$AV$22)/(IF(STDEV($M$30:M37)<0.01,0.01,STDEV($M$30:M37)))*SQRT(COUNT($M$30:M37))/(2*(COUNT($M$30:M37)-1)))))))","v":{"$error":"#DIV/0!"}},{"$f":"IF((MAX(0,(0.5-((AVERAGE($N$30:N37)-$AW$22)/(IF(STDEV($N$30:N37)<0.01,0.01,STDEV($N$30:N37)))*SQRT(COUNT($N$30:N37))/(2*(COUNT($N$30:N37)-1))))))>1,1,(MAX(0,(0.5-((AVERAGE($N$30:N37)-$AW$22)/(IF(STDEV($N$30:N37)<0.01,0.01,STDEV($N$30:N37)))*SQRT(COUNT($N$30:N37))/(2*(COUNT($N$30:N37)-1)))))))","v":{"$error":"#DIV/0!"}},{"$f":"IF((MAX(0,(0.5-((AVERAGE($S$30:S37)-$AX$22)/(IF(STDEV($S$30:S37)<0.01,0.01,STDEV($S$30:S37)))*SQRT(COUNT($S$30:S37))/(2*(COUNT($S$30:S37)-1))))))>1,1,(MAX(0,(0.5-((AVERAGE($S$30:S37)-$AX$22)/(IF(STDEV($S$30:S37)<0.01,0.01,STDEV($S$30:S37)))*SQRT(COUNT($S$30:S37))/(2*(COUNT($S$30:S37)-1)))))))","v":{"$error":"#DIV/0!"}},{"$f":"IF((MAX(0,(0.5-((AVERAGE($T$30:T37)-$AY$22)/(IF(STDEV($T$30:T37)<0.01,0.01,STDEV($T$30:T37)))*SQRT(COUNT($T$30:T37))/(2*(COUNT($T$30:T37)-1))))))>1,1,(MAX(0,(0.5-((AVERAGE($T$30:T37)-$AY$22)/(IF(STDEV($T$30:T37)<0.01,0.01,STDEV($T$30:T37)))*SQRT(COUNT($T$30:T37))/(2*(COUNT($T$30:T37)-1)))))))","v":{"$error":"#DIV/0!"}},{"$f":"IF((MAX(0,(0.5-((AVERAGE($AA$30:AA37)-$AZ$22)/(IF(STDEV($AA$30:AA37)<0.01,0.01,STDEV($AA$30:AA37)))*SQRT(COUNT($AA$30:AA37))/(2*(COUNT($AA$30:AA37)-1))))))>1,1,(MAX(0,(0.5-((AVERAGE($AA$30:AA37)-$AZ$22)/(IF(STDEV($AA$30:AA37)<0.01,0.01,STDEV($AA$30:AA37)))*SQRT(COUNT($AA$30:AA37))/(2*(COUNT($AA$30:AA37)-1)))))))","v":{"$error":"#DIV/0!"}},{"$f":"IF((MAX(0,(0.5-((AVERAGE($AB$30:AB37)-$BA$22)/(IF(STDEV($AB$30:AB37)<0.01,0.01,STDEV($AB$30:AB37)))*SQRT(COUNT($AB$30:AB37))/(2*(COUNT($AB$30:AB37)-1))))))>1,1,(MAX(0,(0.5-((AVERAGE($AB$30:AB37)-$BA$22)/(IF(STDEV($AB$30:AB37)<0.01,0.01,STDEV($AB$30:AB37)))*SQRT(COUNT($AB$30:AB37))/(2*(COUNT($AB$30:AB37)-1)))))))","v":{"$error":"#DIV/0!"}},null,null,{"$f":"(0.5 * ((100-(BETADIST(AK37,((COUNT(M$30:M37))/2)-1,((COUNT(M$30:M37))/2)-1))*100) + (100-(BETADIST(AV37,((COUNT(M$30:M37))/2)-1,((COUNT(M$30:M37))/2)-1))*100) - 100) + 55) / 100","v":{"$error":"#VALUE!"}},{"$f":"(0.5 * ((100-(BETADIST(AL37,((COUNT(N$30:N37))/2)-1,((COUNT(N$30:N37))/2)-1))*100) + (100-(BETADIST(AW37,((COUNT(N$30:N37))/2)-1,((COUNT(N$30:N37))/2)-1))*100) - 100) + 55) / 100","v":{"$error":"#VALUE!"}},{"$f":"(0.5 * ((100-(BETADIST(AQ37,((COUNT(S$30:S37))/2)-1,((COUNT(S$30:S37))/2)-1))*100) + (100-(BETADIST(AX37,((COUNT(S$30:S37))/2)-1,((COUNT(S$30:S37))/2)-1))*100) - 100) + 55) / 100","v":{"$error":"#VALUE!"}},{"$f":"(0.5 * ((100-(BETADIST(AR37,((COUNT(T$30:T37))/2)-1,((COUNT(T$30:T37))/2)-1))*100) + (100-(BETADIST(AY37,((COUNT(T$30:T37))/2)-1,((COUNT(T$30:T37))/2)-1))*100) - 100) + 55) / 100","v":{"$error":"#VALUE!"}},{"$f":"(0.5 * ((100-(BETADIST(AS37,((COUNT(AA$30:AA37))/2)-1,((COUNT(AA$30:AA37))/2)-1))*100) + (100-(BETADIST(AZ37,((COUNT(AA$30:AA37))/2)-1,((COUNT(AA$30:AA37))/2)-1))*100) - 100) + 55) / 100","v":{"$error":"#DIV/0!"}},{"$f":"(0.5 * ((100-(BETADIST(AT37,((COUNT(AB$30:AB37))/2)-1,((COUNT(AB$30:AB37))/2)-1))*100) + (100-(BETADIST(BA37,((COUNT(AB$30:AB37))/2)-1,((COUNT(AB$30:AB37))/2)-1))*100) - 100) + 55) / 100","v":{"$error":"#VALUE!"}},{"$error":"#VALUE!"},null,null,null,null,null,null,null,null,null,null,null,null,null,null,null,null,null,null,null,null,null,null,null,null,null,null,null,null,null,null,null,null,null,null,null,null,null,null,null,null,null,null,null,null,null,1,8,null,null,null,null,88,null,92,null,40,null,18,null,null,4.9000000000000004,4.9800000000000004,92.5,92.3,92.4]
[null,null,null,null,null,null,null,null,null,null,null,null,null,null,null,null,null,null,null,null,null,null,null,null,null,null,"","",null,null,0,0,0,0,0,0,{"$f":"IF((MAX(0,(0.5-(($AK$21-AVERAGE($M$30:M38))/(IF(STDEV($M$30:M38)<0.01,0.01,STDEV($M$30:M38)))*SQRT(COUNT($M$30:M38))/(2*(COUNT($M$30:M38)-1))))))>1,1,(MAX(0,(0.5-(($AK$21-AVERAGE($M$30:M38))/(IF(STDEV($M$30:M38)<0.01,0.01,STDEV($M$30:M38)))*SQRT(COUNT($M$30:M38))/(2*(COUNT($M$30:M38)-1)))))))","v":{"$error":"#VALUE!"}},{"$f":"IF((MAX(0,(0.5-(($AL$21-AVERAGE($N$30:N38))/(IF(STDEV($N$30:N38)<0.01,0.01,STDEV($N$30:N38)))*SQRT(COUNT($N$30:N38))/(2*(COUNT($N$30:N38)-1))))))>1,1,(MAX(0,(0.5-(($AL$21-AVERAGE($N$30:N38))/(IF(STDEV($N$30:N38)<0.01,0.01,STDEV($N$30:N38)))*SQRT(COUNT($N$30:N38))/(2*(COUNT($N$30:N38)-1)))))))","v":{"$error":"#VALUE!"}},0,0,0,0,{"$f":"IF((MAX(0,(0.5-(($AQ$21-AVERAGE($S$30:S38))/(IF(STDEV($S$30:S38)<0.01,0.01,STDEV($S$30:S38)))*SQRT(COUNT($S$30:S38))/(2*(COUNT($S$30:S38)-1))))))>1,1,(MAX(0,(0.5-(($AQ$21-AVERAGE($S$30:S38))/(IF(STDEV($S$30:S38)<0.01,0.01,STDEV($S$30:S38)))*SQRT(COUNT($S$30:S38))/(2*(COUNT($S$30:S38)-1)))))))","v":{"$error":"#VALUE!"}},{"$f":"IF((MAX(0,(0.5-(($AR$21-AVERAGE($T$30:T38))/(IF(STDEV($T$30:T38)<0.01,0.01,STDEV($T$30:T38)))*SQRT(COUNT($T$30:T38))/(2*(COUNT($T$30:T38)-1))))))>1,1,(MAX(0,(0.5-(($AR$21-AVERAGE($T$30:T38))/(IF(STDEV($T$30:T38)<0.01,0.01,STDEV($T$30:T38)))*SQRT(COUNT($T$30:T38))/(2*(COUNT($T$30:T38)-1)))))))","v":{"$error":"#VALUE!"}},{"$f":"IF((MAX(0,(0.5-(($AS$21-AVERAGE($AA$30:AA38))/(IF(STDEV($AA$30:AA38)<0.01,0.01,STDEV($AA$30:AA38)))*SQRT(COUNT($AA$30:AA38))/(2*(COUNT($AA$30:AA38)-1))))))>1,1,(MAX(0,(0.5-(($AS$21-AVERAGE($AA$30:AA38))/(IF(STDEV($AA$30:AA38)<0.01,0.01,STDEV($AA$30:AA38)))*SQRT(COUNT($AA$30:AA38))/(2*(COUNT($AA$30:AA38)-1)))))))","v":{"$error":"#DIV/0!"}},{"$f":"IF((MAX(0,(0.5-(($AT$21-AVERAGE($AB$30:AB38))/(IF(STDEV($AB$30:AB38)<0.01,0.01,STDEV($AB$30:AB38)))*SQRT(COUNT($AB$30:AB38))/(2*(COUNT($AB$30:AB38)-1))))))>1,1,(MAX(0,(0.5-(($AT$21-AVERAGE($AB$30:AB38))/(IF(STDEV($AB$30:AB38)<0.01,0.01,STDEV($AB$30:AB38)))*SQRT(COUNT($AB$30:AB38))/(2*(COUNT($AB$30:AB38)-1)))))))","v":{"$error":"#VALUE!"}},null,{"$f":"IF((MAX(0,(0.5-((AVERAGE($M$30:M38)-$AV$22)/(IF(STDEV($M$30:M38)<0.01,0.01,STDEV($M$30:M38)))*SQRT(COUNT($M$30:M38))/(2*(COUNT($M$30:M38)-1))))))>1,1,(MAX(0,(0.5-((AVERAGE($M$30:M38)-$AV$22)/(IF(STDEV($M$30:M38)<0.01,0.01,STDEV($M$30:M38)))*SQRT(COUNT($M$30:M38))/(2*(COUNT($M$30:M38)-1)))))))","v":{"$error":"#DIV/0!"}},{"$f":"IF((MAX(0,(0.5-((AVERAGE($N$30:N38)-$AW$22)/(IF(STDEV($N$30:N38)<0.01,0.01,STDEV($N$30:N38)))*SQRT(COUNT($N$30:N38))/(2*(COUNT($N$30:N38)-1))))))>1,1,(MAX(0,(0.5-((AVERAGE($N$30:N38)-$AW$22)/(IF(STDEV($N$30:N38)<0.01,0.01,STDEV($N$30:N38)))*SQRT(COUNT($N$30:N38))/(2*(COUNT($N$30:N38)-1)))))))","v":{"$error":"#DIV/0!"}},{"$f":"IF((MAX(0,(0.5-((AVERAGE($S$30:S38)-$AX$22)/(IF(STDEV($S$30:S38)<0.01,0.01,STDEV($S$30:S38)))*SQRT(COUNT($S$30:S38))/(2*(COUNT($S$30:S38)-1))))))>1,1,(MAX(0,(0.5-((AVERAGE($S$30:S38)-$AX$22)/(IF(STDEV($S$30:S38)<0.01,0.01,STDEV($S$30:S38)))*SQRT(COUNT($S$30:S38))/(2*(COUNT($S$30:S38)-1)))))))","v":{"$error":"#DIV/0!"}},{"$f":"IF((MAX(0,(0.5-((AVERAGE($T$30:T38)-$AY$22)/(IF(STDEV($T$30:T38)<0.01,0.01,STDEV($T$30:T38)))*SQRT(COUNT($T$30:T38))/(2*(COUNT($T$30:T38)-1))))))>1,1,(MAX(0,(0.5-((AVERAGE($T$30:T38)-$AY$22)/(IF(STDEV($T$30:T38)<0.01,0.01,STDEV($T$30:T38)))*SQRT(COUNT($T$30:T38))/(2*(COUNT($T$30:T38)-1)))))))","v":{"$error":"#DIV/0!"}},{"$f":"IF((MAX(0,(0.5-((AVERAGE($AA$30:AA38)-$AZ$22)/(IF(STDEV($AA$30:AA38)<0.01,0.01,STDEV($AA$30:AA38)))*SQRT(COUNT($AA$30:AA38))/(2*(COUNT($AA$30:AA38)-1))))))>1,1,(MAX(0,(0.5-((AVERAGE($AA$30:AA38)-$AZ$22)/(IF(STDEV($AA$30:AA38)<0.01,0.01,STDEV($AA$30:AA38)))*SQRT(COUNT($AA$30:AA38))/(2*(COUNT($AA$30:AA38)-1)))))))","v":{"$error":"#DIV/0!"}},{"$f":"IF((MAX(0,(0.5-((AVERAGE($AB$30:AB38)-$BA$22)/(IF(STDEV($AB$30:AB38)<0.01,0.01,STDEV($AB$30:AB38)))*SQRT(COUNT($AB$30:AB38))/(2*(COUNT($AB$30:AB38)-1))))))>1,1,(MAX(0,(0.5-((AVERAGE($AB$30:AB38)-$BA$22)/(IF(STDEV($AB$30:AB38)<0.01,0.01,STDEV($AB$30:AB38)))*SQRT(COUNT($AB$30:AB38))/(2*(COUNT($AB$30:AB38)-1)))))))","v":{"$error":"#DIV/0!"}},null,null,{"$f":"(0.5 * ((100-(BETADIST(AK38,((COUNT(M$30:M38))/2)-1,((COUNT(M$30:M38))/2)-1))*100) + (100-(BETADIST(AV38,((COUNT(M$30:M38))/2)-1,((COUNT(M$30:M38))/2)-1))*100) - 100) + 55) / 100","v":{"$error":"#VALUE!"}},{"$f":"(0.5 * ((100-(BETADIST(AL38,((COUNT(N$30:N38))/2)-1,((COUNT(N$30:N38))/2)-1))*100) + (100-(BETADIST(AW38,((COUNT(N$30:N38))/2)-1,((COUNT(N$30:N38))/2)-1))*100) - 100) + 55) / 100","v":{"$error":"#VALUE!"}},{"$f":"(0.5 * ((100-(BETADIST(AQ38,((COUNT(S$30:S38))/2)-1,((COUNT(S$30:S38))/2)-1))*100) + (100-(BETADIST(AX38,((COUNT(S$30:S38))/2)-1,((COUNT(S$30:S38))/2)-1))*100) - 100) + 55) / 100","v":{"$error":"#VALUE!"}},{"$f":"(0.5 * ((100-(BETADIST(AR38,((COUNT(T$30:T38))/2)-1,((COUNT(T$30:T38))/2)-1))*100) + (100-(BETADIST(AY38,((COUNT(T$30:T38))/2)-1,((COUNT(T$30:T38))/2)-1))*100) - 100) + 55) / 100","v":{"$error":"#VALUE!"}},{"$f":"(0.5 * ((100-(BETADIST(AS38,((COUNT(AA$30:AA38))/2)-1,((COUNT(AA$30:AA38))/2)-1))*100) + (100-(BETADIST(AZ38,((COUNT(AA$30:AA38))/2)-1,((COUNT(AA$30:AA38))/2)-1))*100) - 100) + 55) / 100","v":{"$error":"#DIV/0!"}},{"$f":"(0.5 * ((100-(BETADIST(AT38,((COUNT(AB$30:AB38))/2)-1,((COUNT(AB$30:AB38))/2)-1))*100) + (100-(BETADIST(BA38,((COUNT(AB$30:AB38))/2)-1,((COUNT(AB$30:AB38))/2)-1))*100) - 100) + 55) / 100","v":{"$error":"#VALUE!"}},{"$error":"#VALUE!"},null,null,null,null,null,null,null,null,null,null,null,null,null,null,null,null,null,null,null,null,null,null,null,null,null,null,null,null,null,null,null,null,null,null,null,null,null,null,null,null,null,null,null,"2009-07-17",null,1,9,"YES",null,null,null,91,null,93,null,40,null,19,null,null,10,5.0999999999999996,90.1,90.2,90.3,4,4,4]
[null,null,null,null,null,null,null,null,null,null,null,null,null,null,null,null,null,null,null,null,null,null,null,null,null,null,"","",null,null,0,0,0,0,0,0,{"$f":"IF((MAX(0,(0.5-(($AK$21-AVERAGE($M$30:M39))/(IF(STDEV($M$30:M39)<0.01,0.01,STDEV($M$30:M39)))*SQRT(COUNT($M$30:M39))/(2*(COUNT($M$30:M39)-1))))))>1,1,(MAX(0,(0.5-(($AK$21-AVERAGE($M$30:M39))/(IF(STDEV($M$30:M39)<0.01,0.01,STDEV($M$30:M39)))*SQRT(COUNT($M$30:M39))/(2*(COUNT($M$30:M39)-1)))))))","v":{"$error":"#VALUE!"}},{"$f":"IF((MAX(0,(0.5-(($AL$21-AVERAGE($N$30:N39))/(IF(STDEV($N$30:N39)<0.01,0.01,STDEV($N$30:N39)))*SQRT(COUNT($N$30:N39))/(2*(COUNT($N$30:N39)-1))))))>1,1,(MAX(0,(0.5-(($AL$21-AVERAGE($N$30:N39))/(IF(STDEV($N$30:N39)<0.01,0.01,STDEV($N$30:N39)))*SQRT(COUNT($N$30:N39))/(2*(COUNT($N$30:N39)-1)))))))","v":{"$error":"#VALUE!"}},0,0,0,0,{"$f":"IF((MAX(0,(0.5-(($AQ$21-AVERAGE($S$30:S39))/(IF(STDEV($S$30:S39)<0.01,0.01,STDEV($S$30:S39)))*SQRT(COUNT($S$30:S39))/(2*(COUNT($S$30:S39)-1))))))>1,1,(MAX(0,(0.5-(($AQ$21-AVERAGE($S$30:S39))/(IF(STDEV($S$30:S39)<0.01,0.01,STDEV($S$30:S39)))*SQRT(COUNT($S$30:S39))/(2*(COUNT($S$30:S39)-1)))))))","v":{"$error":"#VALUE!"}},{"$f":"IF((MAX(0,(0.5-(($AR$21-AVERAGE($T$30:T39))/(IF(STDEV($T$30:T39)<0.01,0.01,STDEV($T$30:T39)))*SQRT(COUNT($T$30:T39))/(2*(COUNT($T$30:T39)-1))))))>1,1,(MAX(0,(0.5-(($AR$21-AVERAGE($T$30:T39))/(IF(STDEV($T$30:T39)<0.01,0.01,STDEV($T$30:T39)))*SQRT(COUNT($T$30:T39))/(2*(COUNT($T$30:T39)-1)))))))","v":{"$error":"#VALUE!"}},{"$f":"IF((MAX(0,(0.5-(($AS$21-AVERAGE($AA$30:AA39))/(IF(STDEV($AA$30:AA39)<0.01,0.01,STDEV($AA$30:AA39)))*SQRT(COUNT($AA$30:AA39))/(2*(COUNT($AA$30:AA39)-1))))))>1,1,(MAX(0,(0.5-(($AS$21-AVERAGE($AA$30:AA39))/(IF(STDEV($AA$30:AA39)<0.01,0.01,STDEV($AA$30:AA39)))*SQRT(COUNT($AA$30:AA39))/(2*(COUNT($AA$30:AA39)-1)))))))","v":{"$error":"#DIV/0!"}},{"$f":"IF((MAX(0,(0.5-(($AT$21-AVERAGE($AB$30:AB39))/(IF(STDEV($AB$30:AB39)<0.01,0.01,STDEV($AB$30:AB39)))*SQRT(COUNT($AB$30:AB39))/(2*(COUNT($AB$30:AB39)-1))))))>1,1,(MAX(0,(0.5-(($AT$21-AVERAGE($AB$30:AB39))/(IF(STDEV($AB$30:AB39)<0.01,0.01,STDEV($AB$30:AB39)))*SQRT(COUNT($AB$30:AB39))/(2*(COUNT($AB$30:AB39)-1)))))))","v":{"$error":"#VALUE!"}},null,{"$f":"IF((MAX(0,(0.5-((AVERAGE($M$30:M39)-$AV$22)/(IF(STDEV($M$30:M39)<0.01,0.01,STDEV($M$30:M39)))*SQRT(COUNT($M$30:M39))/(2*(COUNT($M$30:M39)-1))))))>1,1,(MAX(0,(0.5-((AVERAGE($M$30:M39)-$AV$22)/(IF(STDEV($M$30:M39)<0.01,0.01,STDEV($M$30:M39)))*SQRT(COUNT($M$30:M39))/(2*(COUNT($M$30:M39)-1)))))))","v":{"$error":"#DIV/0!"}},{"$f":"IF((MAX(0,(0.5-((AVERAGE($N$30:N39)-$AW$22)/(IF(STDEV($N$30:N39)<0.01,0.01,STDEV($N$30:N39)))*SQRT(COUNT($N$30:N39))/(2*(COUNT($N$30:N39)-1))))))>1,1,(MAX(0,(0.5-((AVERAGE($N$30:N39)-$AW$22)/(IF(STDEV($N$30:N39)<0.01,0.01,STDEV($N$30:N39)))*SQRT(COUNT($N$30:N39))/(2*(COUNT($N$30:N39)-1)))))))","v":{"$error":"#DIV/0!"}},{"$f":"IF((MAX(0,(0.5-((AVERAGE($S$30:S39)-$AX$22)/(IF(STDEV($S$30:S39)<0.01,0.01,STDEV($S$30:S39)))*SQRT(COUNT($S$30:S39))/(2*(COUNT($S$30:S39)-1))))))>1,1,(MAX(0,(0.5-((AVERAGE($S$30:S39)-$AX$22)/(IF(STDEV($S$30:S39)<0.01,0.01,STDEV($S$30:S39)))*SQRT(COUNT($S$30:S39))/(2*(COUNT($S$30:S39)-1)))))))","v":{"$error":"#DIV/0!"}},{"$f":"IF((MAX(0,(0.5-((AVERAGE($T$30:T39)-$AY$22)/(IF(STDEV($T$30:T39)<0.01,0.01,STDEV($T$30:T39)))*SQRT(COUNT($T$30:T39))/(2*(COUNT($T$30:T39)-1))))))>1,1,(MAX(0,(0.5-((AVERAGE($T$30:T39)-$AY$22)/(IF(STDEV($T$30:T39)<0.01,0.01,STDEV($T$30:T39)))*SQRT(COUNT($T$30:T39))/(2*(COUNT($T$30:T39)-1)))))))","v":{"$error":"#DIV/0!"}},{"$f":"IF((MAX(0,(0.5-((AVERAGE($AA$30:AA39)-$AZ$22)/(IF(STDEV($AA$30:AA39)<0.01,0.01,STDEV($AA$30:AA39)))*SQRT(COUNT($AA$30:AA39))/(2*(COUNT($AA$30:AA39)-1))))))>1,1,(MAX(0,(0.5-((AVERAGE($AA$30:AA39)-$AZ$22)/(IF(STDEV($AA$30:AA39)<0.01,0.01,STDEV($AA$30:AA39)))*SQRT(COUNT($AA$30:AA39))/(2*(COUNT($AA$30:AA39)-1)))))))","v":{"$error":"#DIV/0!"}},{"$f":"IF((MAX(0,(0.5-((AVERAGE($AB$30:AB39)-$BA$22)/(IF(STDEV($AB$30:AB39)<0.01,0.01,STDEV($AB$30:AB39)))*SQRT(COUNT($AB$30:AB39))/(2*(COUNT($AB$30:AB39)-1))))))>1,1,(MAX(0,(0.5-((AVERAGE($AB$30:AB39)-$BA$22)/(IF(STDEV($AB$30:AB39)<0.01,0.01,STDEV($AB$30:AB39)))*SQRT(COUNT($AB$30:AB39))/(2*(COUNT($AB$30:AB39)-1)))))))","v":{"$error":"#DIV/0!"}},null,null,{"$f":"(0.5 * ((100-(BETADIST(AK39,((COUNT(M$30:M39))/2)-1,((COUNT(M$30:M39))/2)-1))*100) + (100-(BETADIST(AV39,((COUNT(M$30:M39))/2)-1,((COUNT(M$30:M39))/2)-1))*100) - 100) + 55) / 100","v":{"$error":"#VALUE!"}},{"$f":"(0.5 * ((100-(BETADIST(AL39,((COUNT(N$30:N39))/2)-1,((COUNT(N$30:N39))/2)-1))*100) + (100-(BETADIST(AW39,((COUNT(N$30:N39))/2)-1,((COUNT(N$30:N39))/2)-1))*100) - 100) + 55) / 100","v":{"$error":"#VALUE!"}},{"$f":"(0.5 * ((100-(BETADIST(AQ39,((COUNT(S$30:S39))/2)-1,((COUNT(S$30:S39))/2)-1))*100) + (100-(BETADIST(AX39,((COUNT(S$30:S39))/2)-1,((COUNT(S$30:S39))/2)-1))*100) - 100) + 55) / 100","v":{"$error":"#VALUE!"}},{"$f":"(0.5 * ((100-(BETADIST(AR39,((COUNT(T$30:T39))/2)-1,((COUNT(T$30:T39))/2)-1))*100) + (100-(BETADIST(AY39,((COUNT(T$30:T39))/2)-1,((COUNT(T$30:T39))/2)-1))*100) - 100) + 55) / 100","v":{"$error":"#VALUE!"}},{"$f":"(0.5 * ((100-(BETADIST(AS39,((COUNT(AA$30:AA39))/2)-1,((COUNT(AA$30:AA39))/2)-1))*100) + (100-(BETADIST(AZ39,((COUNT(AA$30:AA39))/2)-1,((COUNT(AA$30:AA39))/2)-1))*100) - 100) + 55) / 100","v":{"$error":"#DIV/0!"}},{"$f":"(0.5 * ((100-(BETADIST(AT39,((COUNT(AB$30:AB39))/2)-1,((COUNT(AB$30:AB39))/2)-1))*100) + (100-(BETADIST(BA39,((COUNT(AB$30:AB39))/2)-1,((COUNT(AB$30:AB39))/2)-1))*100) - 100) + 55) / 100","v":{"$error":"#VALUE!"}},{"$error":"#VALUE!"},null,null,null,null,null,null,null,null,null,null,null,null,null,null,null,null,null,null,null,null,null,null,null,null,null,null,null,null,null,null,null,null,null,null,null,null,null,null,null,null,null,null,null,null,null,1,10,null,null,null,null,88,null,null,null,41,null,20,null,null,8,5.19,90.4,93.3,95.2]
[null,null,null,null,null,null,null,null,null,null,null,null,null,null,null,null,null,null,null,null,null,null,null,null,null,null,"","",null,null,0,0,0,0,0,0,{"$f":"IF((MAX(0,(0.5-(($AK$21-AVERAGE($M$30:M40))/(IF(STDEV($M$30:M40)<0.01,0.01,STDEV($M$30:M40)))*SQRT(COUNT($M$30:M40))/(2*(COUNT($M$30:M40)-1))))))>1,1,(MAX(0,(0.5-(($AK$21-AVERAGE($M$30:M40))/(IF(STDEV($M$30:M40)<0.01,0.01,STDEV($M$30:M40)))*SQRT(COUNT($M$30:M40))/(2*(COUNT($M$30:M40)-1)))))))","v":{"$error":"#VALUE!"}},{"$f":"IF((MAX(0,(0.5-(($AL$21-AVERAGE($N$30:N40))/(IF(STDEV($N$30:N40)<0.01,0.01,STDEV($N$30:N40)))*SQRT(COUNT($N$30:N40))/(2*(COUNT($N$30:N40)-1))))))>1,1,(MAX(0,(0.5-(($AL$21-AVERAGE($N$30:N40))/(IF(STDEV($N$30:N40)<0.01,0.01,STDEV($N$30:N40)))*SQRT(COUNT($N$30:N40))/(2*(COUNT($N$30:N40)-1)))))))","v":{"$error":"#VALUE!"}},0,0,0,0,{"$f":"IF((MAX(0,(0.5-(($AQ$21-AVERAGE($S$30:S40))/(IF(STDEV($S$30:S40)<0.01,0.01,STDEV($S$30:S40)))*SQRT(COUNT($S$30:S40))/(2*(COUNT($S$30:S40)-1))))))>1,1,(MAX(0,(0.5-(($AQ$21-AVERAGE($S$30:S40))/(IF(STDEV($S$30:S40)<0.01,0.01,STDEV($S$30:S40)))*SQRT(COUNT($S$30:S40))/(2*(COUNT($S$30:S40)-1)))))))","v":{"$error":"#VALUE!"}},{"$f":"IF((MAX(0,(0.5-(($AR$21-AVERAGE($T$30:T40))/(IF(STDEV($T$30:T40)<0.01,0.01,STDEV($T$30:T40)))*SQRT(COUNT($T$30:T40))/(2*(COUNT($T$30:T40)-1))))))>1,1,(MAX(0,(0.5-(($AR$21-AVERAGE($T$30:T40))/(IF(STDEV($T$30:T40)<0.01,0.01,STDEV($T$30:T40)))*SQRT(COUNT($T$30:T40))/(2*(COUNT($T$30:T40)-1)))))))","v":{"$error":"#VALUE!"}},{"$f":"IF((MAX(0,(0.5-(($AS$21-AVERAGE($AA$30:AA40))/(IF(STDEV($AA$30:AA40)<0.01,0.01,STDEV($AA$30:AA40)))*SQRT(COUNT($AA$30:AA40))/(2*(COUNT($AA$30:AA40)-1))))))>1,1,(MAX(0,(0.5-(($AS$21-AVERAGE($AA$30:AA40))/(IF(STDEV($AA$30:AA40)<0.01,0.01,STDEV($AA$30:AA40)))*SQRT(COUNT($AA$30:AA40))/(2*(COUNT($AA$30:AA40)-1)))))))","v":{"$error":"#DIV/0!"}},{"$f":"IF((MAX(0,(0.5-(($AT$21-AVERAGE($AB$30:AB40))/(IF(STDEV($AB$30:AB40)<0.01,0.01,STDEV($AB$30:AB40)))*SQRT(COUNT($AB$30:AB40))/(2*(COUNT($AB$30:AB40)-1))))))>1,1,(MAX(0,(0.5-(($AT$21-AVERAGE($AB$30:AB40))/(IF(STDEV($AB$30:AB40)<0.01,0.01,STDEV($AB$30:AB40)))*SQRT(COUNT($AB$30:AB40))/(2*(COUNT($AB$30:AB40)-1)))))))","v":{"$error":"#VALUE!"}},null,{"$f":"IF((MAX(0,(0.5-((AVERAGE($M$30:M40)-$AV$22)/(IF(STDEV($M$30:M40)<0.01,0.01,STDEV($M$30:M40)))*SQRT(COUNT($M$30:M40))/(2*(COUNT($M$30:M40)-1))))))>1,1,(MAX(0,(0.5-((AVERAGE($M$30:M40)-$AV$22)/(IF(STDEV($M$30:M40)<0.01,0.01,STDEV($M$30:M40)))*SQRT(COUNT($M$30:M40))/(2*(COUNT($M$30:M40)-1)))))))","v":{"$error":"#DIV/0!"}},{"$f":"IF((MAX(0,(0.5-((AVERAGE($N$30:N40)-$AW$22)/(IF(STDEV($N$30:N40)<0.01,0.01,STDEV($N$30:N40)))*SQRT(COUNT($N$30:N40))/(2*(COUNT($N$30:N40)-1))))))>1,1,(MAX(0,(0.5-((AVERAGE($N$30:N40)-$AW$22)/(IF(STDEV($N$30:N40)<0.01,0.01,STDEV($N$30:N40)))*SQRT(COUNT($N$30:N40))/(2*(COUNT($N$30:N40)-1)))))))","v":{"$error":"#DIV/0!"}},{"$f":"IF((MAX(0,(0.5-((AVERAGE($S$30:S40)-$AX$22)/(IF(STDEV($S$30:S40)<0.01,0.01,STDEV($S$30:S40)))*SQRT(COUNT($S$30:S40))/(2*(COUNT($S$30:S40)-1))))))>1,1,(MAX(0,(0.5-((AVERAGE($S$30:S40)-$AX$22)/(IF(STDEV($S$30:S40)<0.01,0.01,STDEV($S$30:S40)))*SQRT(COUNT($S$30:S40))/(2*(COUNT($S$30:S40)-1)))))))","v":{"$error":"#DIV/0!"}},{"$f":"IF((MAX(0,(0.5-((AVERAGE($T$30:T40)-$AY$22)/(IF(STDEV($T$30:T40)<0.01,0.01,STDEV($T$30:T40)))*SQRT(COUNT($T$30:T40))/(2*(COUNT($T$30:T40)-1))))))>1,1,(MAX(0,(0.5-((AVERAGE($T$30:T40)-$AY$22)/(IF(STDEV($T$30:T40)<0.01,0.01,STDEV($T$30:T40)))*SQRT(COUNT($T$30:T40))/(2*(COUNT($T$30:T40)-1)))))))","v":{"$error":"#DIV/0!"}},{"$f":"IF((MAX(0,(0.5-((AVERAGE($AA$30:AA40)-$AZ$22)/(IF(STDEV($AA$30:AA40)<0.01,0.01,STDEV($AA$30:AA40)))*SQRT(COUNT($AA$30:AA40))/(2*(COUNT($AA$30:AA40)-1))))))>1,1,(MAX(0,(0.5-((AVERAGE($AA$30:AA40)-$AZ$22)/(IF(STDEV($AA$30:AA40)<0.01,0.01,STDEV($AA$30:AA40)))*SQRT(COUNT($AA$30:AA40))/(2*(COUNT($AA$30:AA40)-1)))))))","v":{"$error":"#DIV/0!"}},{"$f":"IF((MAX(0,(0.5-((AVERAGE($AB$30:AB40)-$BA$22)/(IF(STDEV($AB$30:AB40)<0.01,0.01,STDEV($AB$30:AB40)))*SQRT(COUNT($AB$30:AB40))/(2*(COUNT($AB$30:AB40)-1))))))>1,1,(MAX(0,(0.5-((AVERAGE($AB$30:AB40)-$BA$22)/(IF(STDEV($AB$30:AB40)<0.01,0.01,STDEV($AB$30:AB40)))*SQRT(COUNT($AB$30:AB40))/(2*(COUNT($AB$30:AB40)-1)))))))","v":{"$error":"#DIV/0!"}},null,null,{"$f":"(0.5 * ((100-(BETADIST(AK40,((COUNT(M$30:M40))/2)-1,((COUNT(M$30:M40))/2)-1))*100) + (100-(BETADIST(AV40,((COUNT(M$30:M40))/2)-1,((COUNT(M$30:M40))/2)-1))*100) - 100) + 55) / 100","v":{"$error":"#VALUE!"}},{"$f":"(0.5 * ((100-(BETADIST(AL40,((COUNT(N$30:N40))/2)-1,((COUNT(N$30:N40))/2)-1))*100) + (100-(BETADIST(AW40,((COUNT(N$30:N40))/2)-1,((COUNT(N$30:N40))/2)-1))*100) - 100) + 55) / 100","v":{"$error":"#VALUE!"}},{"$f":"(0.5 * ((100-(BETADIST(AQ40,((COUNT(S$30:S40))/2)-1,((COUNT(S$30:S40))/2)-1))*100) + (100-(BETADIST(AX40,((COUNT(S$30:S40))/2)-1,((COUNT(S$30:S40))/2)-1))*100) - 100) + 55) / 100","v":{"$error":"#VALUE!"}},{"$f":"(0.5 * ((100-(BETADIST(AR40,((COUNT(T$30:T40))/2)-1,((COUNT(T$30:T40))/2)-1))*100) + (100-(BETADIST(AY40,((COUNT(T$30:T40))/2)-1,((COUNT(T$30:T40))/2)-1))*100) - 100) + 55) / 100","v":{"$error":"#VALUE!"}},{"$f":"(0.5 * ((100-(BETADIST(AS40,((COUNT(AA$30:AA40))/2)-1,((COUNT(AA$30:AA40))/2)-1))*100) + (100-(BETADIST(AZ40,((COUNT(AA$30:AA40))/2)-1,((COUNT(AA$30:AA40))/2)-1))*100) - 100) + 55) / 100","v":{"$error":"#DIV/0!"}},{"$f":"(0.5 * ((100-(BETADIST(AT40,((COUNT(AB$30:AB40))/2)-1,((COUNT(AB$30:AB40))/2)-1))*100) + (100-(BETADIST(BA40,((COUNT(AB$30:AB40))/2)-1,((COUNT(AB$30:AB40))/2)-1))*100) - 100) + 55) / 100","v":{"$error":"#VALUE!"}},{"$error":"#VALUE!"},null,null,null,null,null,null,null,null,null,null,null,null,null,null,null,null,null,null,null,null,null,null,null,null,null,null,null,null,null,null,null,null,null,null,null,null,null,null,null,null,null,null,null,null,null,1,11,null,null,null,null,87,null,null,null,41,null,21,null,null,9,5.0999999999999996,90.5,90.1,90.2,4.2,4.3,4.4000000000000004]
[null,null,null,null,null,null,null,null,null,null,null,null,null,null,null,null,null,null,null,null,null,null,null,null,null,null,"","",null,null,0,0,0,0,0,0,{"$f":"IF((MAX(0,(0.5-(($AK$21-AVERAGE($M$30:M41))/(IF(STDEV($M$30:M41)<0.01,0.01,STDEV($M$30:M41)))*SQRT(COUNT($M$30:M41))/(2*(COUNT($M$30:M41)-1))))))>1,1,(MAX(0,(0.5-(($AK$21-AVERAGE($M$30:M41))/(IF(STDEV($M$30:M41)<0.01,0.01,STDEV($M$30:M41)))*SQRT(COUNT($M$30:M41))/(2*(COUNT($M$30:M41)-1)))))))","v":{"$error":"#VALUE!"}},{"$f":"IF((MAX(0,(0.5-(($AL$21-AVERAGE($N$30:N41))/(IF(STDEV($N$30:N41)<0.01,0.01,STDEV($N$30:N41)))*SQRT(COUNT($N$30:N41))/(2*(COUNT($N$30:N41)-1))))))>1,1,(MAX(0,(0.5-(($AL$21-AVERAGE($N$30:N41))/(IF(STDEV($N$30:N41)<0.01,0.01,STDEV($N$30:N41)))*SQRT(COUNT($N$30:N41))/(2*(COUNT($N$30:N41)-1)))))))","v":{"$error":"#VALUE!"}},0,0,0,0,{"$f":"IF((MAX(0,(0.5-(($AQ$21-AVERAGE($S$30:S41))/(IF(STDEV($S$30:S41)<0.01,0.01,STDEV($S$30:S41)))*SQRT(COUNT($S$30:S41))/(2*(COUNT($S$30:S41)-1))))))>1,1,(MAX(0,(0.5-(($AQ$21-AVERAGE($S$30:S41))/(IF(STDEV($S$30:S41)<0.01,0.01,STDEV($S$30:S41)))*SQRT(COUNT($S$30:S41))/(2*(COUNT($S$30:S41)-1)))))))","v":{"$error":"#VALUE!"}},{"$f":"IF((MAX(0,(0.5-(($AR$21-AVERAGE($T$30:T41))/(IF(STDEV($T$30:T41)<0.01,0.01,STDEV($T$30:T41)))*SQRT(COUNT($T$30:T41))/(2*(COUNT($T$30:T41)-1))))))>1,1,(MAX(0,(0.5-(($AR$21-AVERAGE($T$30:T41))/(IF(STDEV($T$30:T41)<0.01,0.01,STDEV($T$30:T41)))*SQRT(COUNT($T$30:T41))/(2*(COUNT($T$30:T41)-1)))))))","v":{"$error":"#VALUE!"}},{"$f":"IF((MAX(0,(0.5-(($AS$21-AVERAGE($AA$30:AA41))/(IF(STDEV($AA$30:AA41)<0.01,0.01,STDEV($AA$30:AA41)))*SQRT(COUNT($AA$30:AA41))/(2*(COUNT($AA$30:AA41)-1))))))>1,1,(MAX(0,(0.5-(($AS$21-AVERAGE($AA$30:AA41))/(IF(STDEV($AA$30:AA41)<0.01,0.01,STDEV($AA$30:AA41)))*SQRT(COUNT($AA$30:AA41))/(2*(COUNT($AA$30:AA41)-1)))))))","v":{"$error":"#DIV/0!"}},{"$f":"IF((MAX(0,(0.5-(($AT$21-AVERAGE($AB$30:AB41))/(IF(STDEV($AB$30:AB41)<0.01,0.01,STDEV($AB$30:AB41)))*SQRT(COUNT($AB$30:AB41))/(2*(COUNT($AB$30:AB41)-1))))))>1,1,(MAX(0,(0.5-(($AT$21-AVERAGE($AB$30:AB41))/(IF(STDEV($AB$30:AB41)<0.01,0.01,STDEV($AB$30:AB41)))*SQRT(COUNT($AB$30:AB41))/(2*(COUNT($AB$30:AB41)-1)))))))","v":{"$error":"#VALUE!"}},null,{"$f":"IF((MAX(0,(0.5-((AVERAGE($M$30:M41)-$AV$22)/(IF(STDEV($M$30:M41)<0.01,0.01,STDEV($M$30:M41)))*SQRT(COUNT($M$30:M41))/(2*(COUNT($M$30:M41)-1))))))>1,1,(MAX(0,(0.5-((AVERAGE($M$30:M41)-$AV$22)/(IF(STDEV($M$30:M41)<0.01,0.01,STDEV($M$30:M41)))*SQRT(COUNT($M$30:M41))/(2*(COUNT($M$30:M41)-1)))))))","v":{"$error":"#DIV/0!"}},{"$f":"IF((MAX(0,(0.5-((AVERAGE($N$30:N41)-$AW$22)/(IF(STDEV($N$30:N41)<0.01,0.01,STDEV($N$30:N41)))*SQRT(COUNT($N$30:N41))/(2*(COUNT($N$30:N41)-1))))))>1,1,(MAX(0,(0.5-((AVERAGE($N$30:N41)-$AW$22)/(IF(STDEV($N$30:N41)<0.01,0.01,STDEV($N$30:N41)))*SQRT(COUNT($N$30:N41))/(2*(COUNT($N$30:N41)-1)))))))","v":{"$error":"#DIV/0!"}},{"$f":"IF((MAX(0,(0.5-((AVERAGE($S$30:S41)-$AX$22)/(IF(STDEV($S$30:S41)<0.01,0.01,STDEV($S$30:S41)))*SQRT(COUNT($S$30:S41))/(2*(COUNT($S$30:S41)-1))))))>1,1,(MAX(0,(0.5-((AVERAGE($S$30:S41)-$AX$22)/(IF(STDEV($S$30:S41)<0.01,0.01,STDEV($S$30:S41)))*SQRT(COUNT($S$30:S41))/(2*(COUNT($S$30:S41)-1)))))))","v":{"$error":"#DIV/0!"}},{"$f":"IF((MAX(0,(0.5-((AVERAGE($T$30:T41)-$AY$22)/(IF(STDEV($T$30:T41)<0.01,0.01,STDEV($T$30:T41)))*SQRT(COUNT($T$30:T41))/(2*(COUNT($T$30:T41)-1))))))>1,1,(MAX(0,(0.5-((AVERAGE($T$30:T41)-$AY$22)/(IF(STDEV($T$30:T41)<0.01,0.01,STDEV($T$30:T41)))*SQRT(COUNT($T$30:T41))/(2*(COUNT($T$30:T41)-1)))))))","v":{"$error":"#DIV/0!"}},{"$f":"IF((MAX(0,(0.5-((AVERAGE($AA$30:AA41)-$AZ$22)/(IF(STDEV($AA$30:AA41)<0.01,0.01,STDEV($AA$30:AA41)))*SQRT(COUNT($AA$30:AA41))/(2*(COUNT($AA$30:AA41)-1))))))>1,1,(MAX(0,(0.5-((AVERAGE($AA$30:AA41)-$AZ$22)/(IF(STDEV($AA$30:AA41)<0.01,0.01,STDEV($AA$30:AA41)))*SQRT(COUNT($AA$30:AA41))/(2*(COUNT($AA$30:AA41)-1)))))))","v":{"$error":"#DIV/0!"}},{"$f":"IF((MAX(0,(0.5-((AVERAGE($AB$30:AB41)-$BA$22)/(IF(STDEV($AB$30:AB41)<0.01,0.01,STDEV($AB$30:AB41)))*SQRT(COUNT($AB$30:AB41))/(2*(COUNT($AB$30:AB41)-1))))))>1,1,(MAX(0,(0.5-((AVERAGE($AB$30:AB41)-$BA$22)/(IF(STDEV($AB$30:AB41)<0.01,0.01,STDEV($AB$30:AB41)))*SQRT(COUNT($AB$30:AB41))/(2*(COUNT($AB$30:AB41)-1)))))))","v":{"$error":"#DIV/0!"}},null,null,{"$f":"(0.5 * ((100-(BETADIST(AK41,((COUNT(M$30:M41))/2)-1,((COUNT(M$30:M41))/2)-1))*100) + (100-(BETADIST(AV41,((COUNT(M$30:M41))/2)-1,((COUNT(M$30:M41))/2)-1))*100) - 100) + 55) / 100","v":{"$error":"#VALUE!"}},{"$f":"(0.5 * ((100-(BETADIST(AL41,((COUNT(N$30:N41))/2)-1,((COUNT(N$30:N41))/2)-1))*100) + (100-(BETADIST(AW41,((COUNT(N$30:N41))/2)-1,((COUNT(N$30:N41))/2)-1))*100) - 100) + 55) / 100","v":{"$error":"#VALUE!"}},{"$f":"(0.5 * ((100-(BETADIST(AQ41,((COUNT(S$30:S41))/2)-1,((COUNT(S$30:S41))/2)-1))*100) + (100-(BETADIST(AX41,((COUNT(S$30:S41))/2)-1,((COUNT(S$30:S41))/2)-1))*100) - 100) + 55) / 100","v":{"$error":"#VALUE!"}},{"$f":"(0.5 * ((100-(BETADIST(AR41,((COUNT(T$30:T41))/2)-1,((COUNT(T$30:T41))/2)-1))*100) + (100-(BETADIST(AY41,((COUNT(T$30:T41))/2)-1,((COUNT(T$30:T41))/2)-1))*100) - 100) + 55) / 100","v":{"$error":"#VALUE!"}},{"$f":"(0.5 * ((100-(BETADIST(AS41,((COUNT(AA$30:AA41))/2)-1,((COUNT(AA$30:AA41))/2)-1))*100) + (100-(BETADIST(AZ41,((COUNT(AA$30:AA41))/2)-1,((COUNT(AA$30:AA41))/2)-1))*100) - 100) + 55) / 100","v":{"$error":"#DIV/0!"}},{"$f":"(0.5 * ((100-(BETADIST(AT41,((COUNT(AB$30:AB41))/2)-1,((COUNT(AB$30:AB41))/2)-1))*100) + (100-(BETADIST(BA41,((COUNT(AB$30:AB41))/2)-1,((COUNT(AB$30:AB41))/2)-1))*100) - 100) + 55) / 100","v":{"$error":"#VALUE!"}},{"$error":"#VALUE!"},null,null,null,null,null,null,null,null,null,null,null,null,null,null,null,null,null,null,null,null,null,null,null,null,null,null,null,null,null,null,null,null,null,null,null,null,null,null,null,null,null,null,"G3",null,null,1,12,null,null,null,null,90,null,null,null,38,null,20,null,null,10,5.2,89.1,89.2,89.3]
[null,null,null,null,null,null,null,null,null,null,null,null,null,null,null,null,null,null,null,null,null,null,null,null,null,null,"","",null,null,0,0,0,0,0,0,{"$f":"IF((MAX(0,(0.5-(($AK$21-AVERAGE($M$30:M42))/(IF(STDEV($M$30:M42)<0.01,0.01,STDEV($M$30:M42)))*SQRT(COUNT($M$30:M42))/(2*(COUNT($M$30:M42)-1))))))>1,1,(MAX(0,(0.5-(($AK$21-AVERAGE($M$30:M42))/(IF(STDEV($M$30:M42)<0.01,0.01,STDEV($M$30:M42)))*SQRT(COUNT($M$30:M42))/(2*(COUNT($M$30:M42)-1)))))))","v":{"$error":"#VALUE!"}},{"$f":"IF((MAX(0,(0.5-(($AL$21-AVERAGE($N$30:N42))/(IF(STDEV($N$30:N42)<0.01,0.01,STDEV($N$30:N42)))*SQRT(COUNT($N$30:N42))/(2*(COUNT($N$30:N42)-1))))))>1,1,(MAX(0,(0.5-(($AL$21-AVERAGE($N$30:N42))/(IF(STDEV($N$30:N42)<0.01,0.01,STDEV($N$30:N42)))*SQRT(COUNT($N$30:N42))/(2*(COUNT($N$30:N42)-1)))))))","v":{"$error":"#VALUE!"}},0,0,0,0,{"$f":"IF((MAX(0,(0.5-(($AQ$21-AVERAGE($S$30:S42))/(IF(STDEV($S$30:S42)<0.01,0.01,STDEV($S$30:S42)))*SQRT(COUNT($S$30:S42))/(2*(COUNT($S$30:S42)-1))))))>1,1,(MAX(0,(0.5-(($AQ$21-AVERAGE($S$30:S42))/(IF(STDEV($S$30:S42)<0.01,0.01,STDEV($S$30:S42)))*SQRT(COUNT($S$30:S42))/(2*(COUNT($S$30:S42)-1)))))))","v":{"$error":"#VALUE!"}},{"$f":"IF((MAX(0,(0.5-(($AR$21-AVERAGE($T$30:T42))/(IF(STDEV($T$30:T42)<0.01,0.01,STDEV($T$30:T42)))*SQRT(COUNT($T$30:T42))/(2*(COUNT($T$30:T42)-1))))))>1,1,(MAX(0,(0.5-(($AR$21-AVERAGE($T$30:T42))/(IF(STDEV($T$30:T42)<0.01,0.01,STDEV($T$30:T42)))*SQRT(COUNT($T$30:T42))/(2*(COUNT($T$30:T42)-1)))))))","v":{"$error":"#VALUE!"}},{"$f":"IF((MAX(0,(0.5-(($AS$21-AVERAGE($AA$30:AA42))/(IF(STDEV($AA$30:AA42)<0.01,0.01,STDEV($AA$30:AA42)))*SQRT(COUNT($AA$30:AA42))/(2*(COUNT($AA$30:AA42)-1))))))>1,1,(MAX(0,(0.5-(($AS$21-AVERAGE($AA$30:AA42))/(IF(STDEV($AA$30:AA42)<0.01,0.01,STDEV($AA$30:AA42)))*SQRT(COUNT($AA$30:AA42))/(2*(COUNT($AA$30:AA42)-1)))))))","v":{"$error":"#DIV/0!"}},{"$f":"IF((MAX(0,(0.5-(($AT$21-AVERAGE($AB$30:AB42))/(IF(STDEV($AB$30:AB42)<0.01,0.01,STDEV($AB$30:AB42)))*SQRT(COUNT($AB$30:AB42))/(2*(COUNT($AB$30:AB42)-1))))))>1,1,(MAX(0,(0.5-(($AT$21-AVERAGE($AB$30:AB42))/(IF(STDEV($AB$30:AB42)<0.01,0.01,STDEV($AB$30:AB42)))*SQRT(COUNT($AB$30:AB42))/(2*(COUNT($AB$30:AB42)-1)))))))","v":{"$error":"#VALUE!"}},null,{"$f":"IF((MAX(0,(0.5-((AVERAGE($M$30:M42)-$AV$22)/(IF(STDEV($M$30:M42)<0.01,0.01,STDEV($M$30:M42)))*SQRT(COUNT($M$30:M42))/(2*(COUNT($M$30:M42)-1))))))>1,1,(MAX(0,(0.5-((AVERAGE($M$30:M42)-$AV$22)/(IF(STDEV($M$30:M42)<0.01,0.01,STDEV($M$30:M42)))*SQRT(COUNT($M$30:M42))/(2*(COUNT($M$30:M42)-1)))))))","v":{"$error":"#DIV/0!"}},{"$f":"IF((MAX(0,(0.5-((AVERAGE($N$30:N42)-$AW$22)/(IF(STDEV($N$30:N42)<0.01,0.01,STDEV($N$30:N42)))*SQRT(COUNT($N$30:N42))/(2*(COUNT($N$30:N42)-1))))))>1,1,(MAX(0,(0.5-((AVERAGE($N$30:N42)-$AW$22)/(IF(STDEV($N$30:N42)<0.01,0.01,STDEV($N$30:N42)))*SQRT(COUNT($N$30:N42))/(2*(COUNT($N$30:N42)-1)))))))","v":{"$error":"#DIV/0!"}},{"$f":"IF((MAX(0,(0.5-((AVERAGE($S$30:S42)-$AX$22)/(IF(STDEV($S$30:S42)<0.01,0.01,STDEV($S$30:S42)))*SQRT(COUNT($S$30:S42))/(2*(COUNT($S$30:S42)-1))))))>1,1,(MAX(0,(0.5-((AVERAGE($S$30:S42)-$AX$22)/(IF(STDEV($S$30:S42)<0.01,0.01,STDEV($S$30:S42)))*SQRT(COUNT($S$30:S42))/(2*(COUNT($S$30:S42)-1)))))))","v":{"$error":"#DIV/0!"}},{"$f":"IF((MAX(0,(0.5-((AVERAGE($T$30:T42)-$AY$22)/(IF(STDEV($T$30:T42)<0.01,0.01,STDEV($T$30:T42)))*SQRT(COUNT($T$30:T42))/(2*(COUNT($T$30:T42)-1))))))>1,1,(MAX(0,(0.5-((AVERAGE($T$30:T42)-$AY$22)/(IF(STDEV($T$30:T42)<0.01,0.01,STDEV($T$30:T42)))*SQRT(COUNT($T$30:T42))/(2*(COUNT($T$30:T42)-1)))))))","v":{"$error":"#DIV/0!"}},{"$f":"IF((MAX(0,(0.5-((AVERAGE($AA$30:AA42)-$AZ$22)/(IF(STDEV($AA$30:AA42)<0.01,0.01,STDEV($AA$30:AA42)))*SQRT(COUNT($AA$30:AA42))/(2*(COUNT($AA$30:AA42)-1))))))>1,1,(MAX(0,(0.5-((AVERAGE($AA$30:AA42)-$AZ$22)/(IF(STDEV($AA$30:AA42)<0.01,0.01,STDEV($AA$30:AA42)))*SQRT(COUNT($AA$30:AA42))/(2*(COUNT($AA$30:AA42)-1)))))))","v":{"$error":"#DIV/0!"}},{"$f":"IF((MAX(0,(0.5-((AVERAGE($AB$30:AB42)-$BA$22)/(IF(STDEV($AB$30:AB42)<0.01,0.01,STDEV($AB$30:AB42)))*SQRT(COUNT($AB$30:AB42))/(2*(COUNT($AB$30:AB42)-1))))))>1,1,(MAX(0,(0.5-((AVERAGE($AB$30:AB42)-$BA$22)/(IF(STDEV($AB$30:AB42)<0.01,0.01,STDEV($AB$30:AB42)))*SQRT(COUNT($AB$30:AB42))/(2*(COUNT($AB$30:AB42)-1)))))))","v":{"$error":"#DIV/0!"}},null,null,{"$f":"(0.5 * ((100-(BETADIST(AK42,((COUNT(M$30:M42))/2)-1,((COUNT(M$30:M42))/2)-1))*100) + (100-(BETADIST(AV42,((COUNT(M$30:M42))/2)-1,((COUNT(M$30:M42))/2)-1))*100) - 100) + 55) / 100","v":{"$error":"#VALUE!"}},{"$f":"(0.5 * ((100-(BETADIST(AL42,((COUNT(N$30:N42))/2)-1,((COUNT(N$30:N42))/2)-1))*100) + (100-(BETADIST(AW42,((COUNT(N$30:N42))/2)-1,((COUNT(N$30:N42))/2)-1))*100) - 100) + 55) / 100","v":{"$error":"#VALUE!"}},{"$f":"(0.5 * ((100-(BETADIST(AQ42,((COUNT(S$30:S42))/2)-1,((COUNT(S$30:S42))/2)-1))*100) + (100-(BETADIST(AX42,((COUNT(S$30:S42))/2)-1,((COUNT(S$30:S42))/2)-1))*100) - 100) + 55) / 100","v":{"$error":"#VALUE!"}},{"$f":"(0.5 * ((100-(BETADIST(AR42,((COUNT(T$30:T42))/2)-1,((COUNT(T$30:T42))/2)-1))*100) + (100-(BETADIST(AY42,((COUNT(T$30:T42))/2)-1,((COUNT(T$30:T42))/2)-1))*100) - 100) + 55) / 100","v":{"$error":"#VALUE!"}},{"$f":"(0.5 * ((100-(BETADIST(AS42,((COUNT(AA$30:AA42))/2)-1,((COUNT(AA$30:AA42))/2)-1))*100) + (100-(BETADIST(AZ42,((COUNT(AA$30:AA42))/2)-1,((COUNT(AA$30:AA42))/2)-1))*100) - 100) + 55) / 100","v":{"$error":"#DIV/0!"}},{"$f":"(0.5 * ((100-(BETADIST(AT42,((COUNT(AB$30:AB42))/2)-1,((COUNT(AB$30:AB42))/2)-1))*100) + (100-(BETADIST(BA42,((COUNT(AB$30:AB42))/2)-1,((COUNT(AB$30:AB42))/2)-1))*100) - 100) + 55) / 100","v":{"$error":"#VALUE!"}},{"$error":"#VALUE!"},null,null,null,null,null,null,null,null,null,null,null,null,null,null,null,null,null,null,null,null,null,null,null,null,null,null,null,null,null,null,null,null,null,null,null,null,null,null,null,null,null,null,null,"2009-07-20",null,1,13,null,null,null,null,91,null,94,null,33,null,19,null,null,5.4,5.14,93.2,92.5,94.6,3.8,3.9,4]
[null,null,null,null,null,null,null,null,null,null,null,null,null,null,null,null,null,null,null,null,null,null,null,null,null,null,"","",null,null,0,0,0,0,0,0,{"$f":"IF((MAX(0,(0.5-(($AK$21-AVERAGE($M$30:M43))/(IF(STDEV($M$30:M43)<0.01,0.01,STDEV($M$30:M43)))*SQRT(COUNT($M$30:M43))/(2*(COUNT($M$30:M43)-1))))))>1,1,(MAX(0,(0.5-(($AK$21-AVERAGE($M$30:M43))/(IF(STDEV($M$30:M43)<0.01,0.01,STDEV($M$30:M43)))*SQRT(COUNT($M$30:M43))/(2*(COUNT($M$30:M43)-1)))))))","v":{"$error":"#VALUE!"}},{"$f":"IF((MAX(0,(0.5-(($AL$21-AVERAGE($N$30:N43))/(IF(STDEV($N$30:N43)<0.01,0.01,STDEV($N$30:N43)))*SQRT(COUNT($N$30:N43))/(2*(COUNT($N$30:N43)-1))))))>1,1,(MAX(0,(0.5-(($AL$21-AVERAGE($N$30:N43))/(IF(STDEV($N$30:N43)<0.01,0.01,STDEV($N$30:N43)))*SQRT(COUNT($N$30:N43))/(2*(COUNT($N$30:N43)-1)))))))","v":{"$error":"#VALUE!"}},0,0,0,0,{"$f":"IF((MAX(0,(0.5-(($AQ$21-AVERAGE($S$30:S43))/(IF(STDEV($S$30:S43)<0.01,0.01,STDEV($S$30:S43)))*SQRT(COUNT($S$30:S43))/(2*(COUNT($S$30:S43)-1))))))>1,1,(MAX(0,(0.5-(($AQ$21-AVERAGE($S$30:S43))/(IF(STDEV($S$30:S43)<0.01,0.01,STDEV($S$30:S43)))*SQRT(COUNT($S$30:S43))/(2*(COUNT($S$30:S43)-1)))))))","v":{"$error":"#VALUE!"}},{"$f":"IF((MAX(0,(0.5-(($AR$21-AVERAGE($T$30:T43))/(IF(STDEV($T$30:T43)<0.01,0.01,STDEV($T$30:T43)))*SQRT(COUNT($T$30:T43))/(2*(COUNT($T$30:T43)-1))))))>1,1,(MAX(0,(0.5-(($AR$21-AVERAGE($T$30:T43))/(IF(STDEV($T$30:T43)<0.01,0.01,STDEV($T$30:T43)))*SQRT(COUNT($T$30:T43))/(2*(COUNT($T$30:T43)-1)))))))","v":{"$error":"#VALUE!"}},{"$f":"IF((MAX(0,(0.5-(($AS$21-AVERAGE($AA$30:AA43))/(IF(STDEV($AA$30:AA43)<0.01,0.01,STDEV($AA$30:AA43)))*SQRT(COUNT($AA$30:AA43))/(2*(COUNT($AA$30:AA43)-1))))))>1,1,(MAX(0,(0.5-(($AS$21-AVERAGE($AA$30:AA43))/(IF(STDEV($AA$30:AA43)<0.01,0.01,STDEV($AA$30:AA43)))*SQRT(COUNT($AA$30:AA43))/(2*(COUNT($AA$30:AA43)-1)))))))","v":{"$error":"#DIV/0!"}},{"$f":"IF((MAX(0,(0.5-(($AT$21-AVERAGE($AB$30:AB43))/(IF(STDEV($AB$30:AB43)<0.01,0.01,STDEV($AB$30:AB43)))*SQRT(COUNT($AB$30:AB43))/(2*(COUNT($AB$30:AB43)-1))))))>1,1,(MAX(0,(0.5-(($AT$21-AVERAGE($AB$30:AB43))/(IF(STDEV($AB$30:AB43)<0.01,0.01,STDEV($AB$30:AB43)))*SQRT(COUNT($AB$30:AB43))/(2*(COUNT($AB$30:AB43)-1)))))))","v":{"$error":"#VALUE!"}},null,{"$f":"IF((MAX(0,(0.5-((AVERAGE($M$30:M43)-$AV$22)/(IF(STDEV($M$30:M43)<0.01,0.01,STDEV($M$30:M43)))*SQRT(COUNT($M$30:M43))/(2*(COUNT($M$30:M43)-1))))))>1,1,(MAX(0,(0.5-((AVERAGE($M$30:M43)-$AV$22)/(IF(STDEV($M$30:M43)<0.01,0.01,STDEV($M$30:M43)))*SQRT(COUNT($M$30:M43))/(2*(COUNT($M$30:M43)-1)))))))","v":{"$error":"#DIV/0!"}},{"$f":"IF((MAX(0,(0.5-((AVERAGE($N$30:N43)-$AW$22)/(IF(STDEV($N$30:N43)<0.01,0.01,STDEV($N$30:N43)))*SQRT(COUNT($N$30:N43))/(2*(COUNT($N$30:N43)-1))))))>1,1,(MAX(0,(0.5-((AVERAGE($N$30:N43)-$AW$22)/(IF(STDEV($N$30:N43)<0.01,0.01,STDEV($N$30:N43)))*SQRT(COUNT($N$30:N43))/(2*(COUNT($N$30:N43)-1)))))))","v":{"$error":"#DIV/0!"}},{"$f":"IF((MAX(0,(0.5-((AVERAGE($S$30:S43)-$AX$22)/(IF(STDEV($S$30:S43)<0.01,0.01,STDEV($S$30:S43)))*SQRT(COUNT($S$30:S43))/(2*(COUNT($S$30:S43)-1))))))>1,1,(MAX(0,(0.5-((AVERAGE($S$30:S43)-$AX$22)/(IF(STDEV($S$30:S43)<0.01,0.01,STDEV($S$30:S43)))*SQRT(COUNT($S$30:S43))/(2*(COUNT($S$30:S43)-1)))))))","v":{"$error":"#DIV/0!"}},{"$f":"IF((MAX(0,(0.5-((AVERAGE($T$30:T43)-$AY$22)/(IF(STDEV($T$30:T43)<0.01,0.01,STDEV($T$30:T43)))*SQRT(COUNT($T$30:T43))/(2*(COUNT($T$30:T43)-1))))))>1,1,(MAX(0,(0.5-((AVERAGE($T$30:T43)-$AY$22)/(IF(STDEV($T$30:T43)<0.01,0.01,STDEV($T$30:T43)))*SQRT(COUNT($T$30:T43))/(2*(COUNT($T$30:T43)-1)))))))","v":{"$error":"#DIV/0!"}},{"$f":"IF((MAX(0,(0.5-((AVERAGE($AA$30:AA43)-$AZ$22)/(IF(STDEV($AA$30:AA43)<0.01,0.01,STDEV($AA$30:AA43)))*SQRT(COUNT($AA$30:AA43))/(2*(COUNT($AA$30:AA43)-1))))))>1,1,(MAX(0,(0.5-((AVERAGE($AA$30:AA43)-$AZ$22)/(IF(STDEV($AA$30:AA43)<0.01,0.01,STDEV($AA$30:AA43)))*SQRT(COUNT($AA$30:AA43))/(2*(COUNT($AA$30:AA43)-1)))))))","v":{"$error":"#DIV/0!"}},{"$f":"IF((MAX(0,(0.5-((AVERAGE($AB$30:AB43)-$BA$22)/(IF(STDEV($AB$30:AB43)<0.01,0.01,STDEV($AB$30:AB43)))*SQRT(COUNT($AB$30:AB43))/(2*(COUNT($AB$30:AB43)-1))))))>1,1,(MAX(0,(0.5-((AVERAGE($AB$30:AB43)-$BA$22)/(IF(STDEV($AB$30:AB43)<0.01,0.01,STDEV($AB$30:AB43)))*SQRT(COUNT($AB$30:AB43))/(2*(COUNT($AB$30:AB43)-1)))))))","v":{"$error":"#DIV/0!"}},null,null,{"$f":"(0.5 * ((100-(BETADIST(AK43,((COUNT(M$30:M43))/2)-1,((COUNT(M$30:M43))/2)-1))*100) + (100-(BETADIST(AV43,((COUNT(M$30:M43))/2)-1,((COUNT(M$30:M43))/2)-1))*100) - 100) + 55) / 100","v":{"$error":"#VALUE!"}},{"$f":"(0.5 * ((100-(BETADIST(AL43,((COUNT(N$30:N43))/2)-1,((COUNT(N$30:N43))/2)-1))*100) + (100-(BETADIST(AW43,((COUNT(N$30:N43))/2)-1,((COUNT(N$30:N43))/2)-1))*100) - 100) + 55) / 100","v":{"$error":"#VALUE!"}},{"$f":"(0.5 * ((100-(BETADIST(AQ43,((COUNT(S$30:S43))/2)-1,((COUNT(S$30:S43))/2)-1))*100) + (100-(BETADIST(AX43,((COUNT(S$30:S43))/2)-1,((COUNT(S$30:S43))/2)-1))*100) - 100) + 55) / 100","v":{"$error":"#VALUE!"}},{"$f":"(0.5 * ((100-(BETADIST(AR43,((COUNT(T$30:T43))/2)-1,((COUNT(T$30:T43))/2)-1))*100) + (100-(BETADIST(AY43,((COUNT(T$30:T43))/2)-1,((COUNT(T$30:T43))/2)-1))*100) - 100) + 55) / 100","v":{"$error":"#VALUE!"}},{"$f":"(0.5 * ((100-(BETADIST(AS43,((COUNT(AA$30:AA43))/2)-1,((COUNT(AA$30:AA43))/2)-1))*100) + (100-(BETADIST(AZ43,((COUNT(AA$30:AA43))/2)-1,((COUNT(AA$30:AA43))/2)-1))*100) - 100) + 55) / 100","v":{"$error":"#DIV/0!"}},{"$f":"(0.5 * ((100-(BETADIST(AT43,((COUNT(AB$30:AB43))/2)-1,((COUNT(AB$30:AB43))/2)-1))*100) + (100-(BETADIST(BA43,((COUNT(AB$30:AB43))/2)-1,((COUNT(AB$30:AB43))/2)-1))*100) - 100) + 55) / 100","v":{"$error":"#VALUE!"}},{"$error":"#VALUE!"},null,null,null,null,null,null,null,null,null,null,null,null,null,null,null,null,null,null,null,null,null,null,null,null,null,null,null,null,null,null,null,null,null,null,null,null,null,null,null,null,null,null,null,null,null,1,14,null,null,null,null,null,null,null,null,33,null,18,null,null,5.8,4.9000000000000004,91.2,96.2,95.2]
[null,null,null,null,null,null,null,null,null,null,null,null,null,null,null,null,null,null,null,null,null,null,null,null,null,null,"","",null,null,0,0,0,0,0,0,{"$f":"IF((MAX(0,(0.5-(($AK$21-AVERAGE($M$30:M44))/(IF(STDEV($M$30:M44)<0.01,0.01,STDEV($M$30:M44)))*SQRT(COUNT($M$30:M44))/(2*(COUNT($M$30:M44)-1))))))>1,1,(MAX(0,(0.5-(($AK$21-AVERAGE($M$30:M44))/(IF(STDEV($M$30:M44)<0.01,0.01,STDEV($M$30:M44)))*SQRT(COUNT($M$30:M44))/(2*(COUNT($M$30:M44)-1)))))))","v":{"$error":"#VALUE!"}},{"$f":"IF((MAX(0,(0.5-(($AL$21-AVERAGE($N$30:N44))/(IF(STDEV($N$30:N44)<0.01,0.01,STDEV($N$30:N44)))*SQRT(COUNT($N$30:N44))/(2*(COUNT($N$30:N44)-1))))))>1,1,(MAX(0,(0.5-(($AL$21-AVERAGE($N$30:N44))/(IF(STDEV($N$30:N44)<0.01,0.01,STDEV($N$30:N44)))*SQRT(COUNT($N$30:N44))/(2*(COUNT($N$30:N44)-1)))))))","v":{"$error":"#VALUE!"}},0,0,0,0,{"$f":"IF((MAX(0,(0.5-(($AQ$21-AVERAGE($S$30:S44))/(IF(STDEV($S$30:S44)<0.01,0.01,STDEV($S$30:S44)))*SQRT(COUNT($S$30:S44))/(2*(COUNT($S$30:S44)-1))))))>1,1,(MAX(0,(0.5-(($AQ$21-AVERAGE($S$30:S44))/(IF(STDEV($S$30:S44)<0.01,0.01,STDEV($S$30:S44)))*SQRT(COUNT($S$30:S44))/(2*(COUNT($S$30:S44)-1)))))))","v":{"$error":"#VALUE!"}},{"$f":"IF((MAX(0,(0.5-(($AR$21-AVERAGE($T$30:T44))/(IF(STDEV($T$30:T44)<0.01,0.01,STDEV($T$30:T44)))*SQRT(COUNT($T$30:T44))/(2*(COUNT($T$30:T44)-1))))))>1,1,(MAX(0,(0.5-(($AR$21-AVERAGE($T$30:T44))/(IF(STDEV($T$30:T44)<0.01,0.01,STDEV($T$30:T44)))*SQRT(COUNT($T$30:T44))/(2*(COUNT($T$30:T44)-1)))))))","v":{"$error":"#VALUE!"}},{"$f":"IF((MAX(0,(0.5-(($AS$21-AVERAGE($AA$30:AA44))/(IF(STDEV($AA$30:AA44)<0.01,0.01,STDEV($AA$30:AA44)))*SQRT(COUNT($AA$30:AA44))/(2*(COUNT($AA$30:AA44)-1))))))>1,1,(MAX(0,(0.5-(($AS$21-AVERAGE($AA$30:AA44))/(IF(STDEV($AA$30:AA44)<0.01,0.01,STDEV($AA$30:AA44)))*SQRT(COUNT($AA$30:AA44))/(2*(COUNT($AA$30:AA44)-1)))))))","v":{"$error":"#DIV/0!"}},{"$f":"IF((MAX(0,(0.5-(($AT$21-AVERAGE($AB$30:AB44))/(IF(STDEV($AB$30:AB44)<0.01,0.01,STDEV($AB$30:AB44)))*SQRT(COUNT($AB$30:AB44))/(2*(COUNT($AB$30:AB44)-1))))))>1,1,(MAX(0,(0.5-(($AT$21-AVERAGE($AB$30:AB44))/(IF(STDEV($AB$30:AB44)<0.01,0.01,STDEV($AB$30:AB44)))*SQRT(COUNT($AB$30:AB44))/(2*(COUNT($AB$30:AB44)-1)))))))","v":{"$error":"#VALUE!"}},null,{"$f":"IF((MAX(0,(0.5-((AVERAGE($M$30:M44)-$AV$22)/(IF(STDEV($M$30:M44)<0.01,0.01,STDEV($M$30:M44)))*SQRT(COUNT($M$30:M44))/(2*(COUNT($M$30:M44)-1))))))>1,1,(MAX(0,(0.5-((AVERAGE($M$30:M44)-$AV$22)/(IF(STDEV($M$30:M44)<0.01,0.01,STDEV($M$30:M44)))*SQRT(COUNT($M$30:M44))/(2*(COUNT($M$30:M44)-1)))))))","v":{"$error":"#DIV/0!"}},{"$f":"IF((MAX(0,(0.5-((AVERAGE($N$30:N44)-$AW$22)/(IF(STDEV($N$30:N44)<0.01,0.01,STDEV($N$30:N44)))*SQRT(COUNT($N$30:N44))/(2*(COUNT($N$30:N44)-1))))))>1,1,(MAX(0,(0.5-((AVERAGE($N$30:N44)-$AW$22)/(IF(STDEV($N$30:N44)<0.01,0.01,STDEV($N$30:N44)))*SQRT(COUNT($N$30:N44))/(2*(COUNT($N$30:N44)-1)))))))","v":{"$error":"#DIV/0!"}},{"$f":"IF((MAX(0,(0.5-((AVERAGE($S$30:S44)-$AX$22)/(IF(STDEV($S$30:S44)<0.01,0.01,STDEV($S$30:S44)))*SQRT(COUNT($S$30:S44))/(2*(COUNT($S$30:S44)-1))))))>1,1,(MAX(0,(0.5-((AVERAGE($S$30:S44)-$AX$22)/(IF(STDEV($S$30:S44)<0.01,0.01,STDEV($S$30:S44)))*SQRT(COUNT($S$30:S44))/(2*(COUNT($S$30:S44)-1)))))))","v":{"$error":"#DIV/0!"}},{"$f":"IF((MAX(0,(0.5-((AVERAGE($T$30:T44)-$AY$22)/(IF(STDEV($T$30:T44)<0.01,0.01,STDEV($T$30:T44)))*SQRT(COUNT($T$30:T44))/(2*(COUNT($T$30:T44)-1))))))>1,1,(MAX(0,(0.5-((AVERAGE($T$30:T44)-$AY$22)/(IF(STDEV($T$30:T44)<0.01,0.01,STDEV($T$30:T44)))*SQRT(COUNT($T$30:T44))/(2*(COUNT($T$30:T44)-1)))))))","v":{"$error":"#DIV/0!"}},{"$f":"IF((MAX(0,(0.5-((AVERAGE($AA$30:AA44)-$AZ$22)/(IF(STDEV($AA$30:AA44)<0.01,0.01,STDEV($AA$30:AA44)))*SQRT(COUNT($AA$30:AA44))/(2*(COUNT($AA$30:AA44)-1))))))>1,1,(MAX(0,(0.5-((AVERAGE($AA$30:AA44)-$AZ$22)/(IF(STDEV($AA$30:AA44)<0.01,0.01,STDEV($AA$30:AA44)))*SQRT(COUNT($AA$30:AA44))/(2*(COUNT($AA$30:AA44)-1)))))))","v":{"$error":"#DIV/0!"}},{"$f":"IF((MAX(0,(0.5-((AVERAGE($AB$30:AB44)-$BA$22)/(IF(STDEV($AB$30:AB44)<0.01,0.01,STDEV($AB$30:AB44)))*SQRT(COUNT($AB$30:AB44))/(2*(COUNT($AB$30:AB44)-1))))))>1,1,(MAX(0,(0.5-((AVERAGE($AB$30:AB44)-$BA$22)/(IF(STDEV($AB$30:AB44)<0.01,0.01,STDEV($AB$30:AB44)))*SQRT(COUNT($AB$30:AB44))/(2*(COUNT($AB$30:AB44)-1)))))))","v":{"$error":"#DIV/0!"}},null,null,{"$f":"(0.5 * ((100-(BETADIST(AK44,((COUNT(M$30:M44))/2)-1,((COUNT(M$30:M44))/2)-1))*100) + (100-(BETADIST(AV44,((COUNT(M$30:M44))/2)-1,((COUNT(M$30:M44))/2)-1))*100) - 100) + 55) / 100","v":{"$error":"#VALUE!"}},{"$f":"(0.5 * ((100-(BETADIST(AL44,((COUNT(N$30:N44))/2)-1,((COUNT(N$30:N44))/2)-1))*100) + (100-(BETADIST(AW44,((COUNT(N$30:N44))/2)-1,((COUNT(N$30:N44))/2)-1))*100) - 100) + 55) / 100","v":{"$error":"#VALUE!"}},{"$f":"(0.5 * ((100-(BETADIST(AQ44,((COUNT(S$30:S44))/2)-1,((COUNT(S$30:S44))/2)-1))*100) + (100-(BETADIST(AX44,((COUNT(S$30:S44))/2)-1,((COUNT(S$30:S44))/2)-1))*100) - 100) + 55) / 100","v":{"$error":"#VALUE!"}},{"$f":"(0.5 * ((100-(BETADIST(AR44,((COUNT(T$30:T44))/2)-1,((COUNT(T$30:T44))/2)-1))*100) + (100-(BETADIST(AY44,((COUNT(T$30:T44))/2)-1,((COUNT(T$30:T44))/2)-1))*100) - 100) + 55) / 100","v":{"$error":"#VALUE!"}},{"$f":"(0.5 * ((100-(BETADIST(AS44,((COUNT(AA$30:AA44))/2)-1,((COUNT(AA$30:AA44))/2)-1))*100) + (100-(BETADIST(AZ44,((COUNT(AA$30:AA44))/2)-1,((COUNT(AA$30:AA44))/2)-1))*100) - 100) + 55) / 100","v":{"$error":"#DIV/0!"}},{"$f":"(0.5 * ((100-(BETADIST(AT44,((COUNT(AB$30:AB44))/2)-1,((COUNT(AB$30:AB44))/2)-1))*100) + (100-(BETADIST(BA44,((COUNT(AB$30:AB44))/2)-1,((COUNT(AB$30:AB44))/2)-1))*100) - 100) + 55) / 100","v":{"$error":"#VALUE!"}},{"$error":"#VALUE!"},null,null,null,null,null,null,null,null,null,null,null,null,null,null,null,null,null,null,null,null,null,null,null,null,null,null,null,null,null,null,null,null,null,null,null,null,null,null,null,null,null,null,null,"2009-07-24",null,1,15,null,null,null,null,null,null,null,null,39,null,17,null,null,4.9000000000000004,5.24,95.2,91.6,93.1,4.5,4.5999999999999996,4.7]
[null,null,null,null,null,null,null,null,null,null,null,null,null,null,null,null,null,null,null,null,null,null,null,null,null,null,"","",null,null,0,0,0,0,0,0,{"$f":"IF((MAX(0,(0.5-(($AK$21-AVERAGE($M$30:M45))/(IF(STDEV($M$30:M45)<0.01,0.01,STDEV($M$30:M45)))*SQRT(COUNT($M$30:M45))/(2*(COUNT($M$30:M45)-1))))))>1,1,(MAX(0,(0.5-(($AK$21-AVERAGE($M$30:M45))/(IF(STDEV($M$30:M45)<0.01,0.01,STDEV($M$30:M45)))*SQRT(COUNT($M$30:M45))/(2*(COUNT($M$30:M45)-1)))))))","v":{"$error":"#VALUE!"}},{"$f":"IF((MAX(0,(0.5-(($AL$21-AVERAGE($N$30:N45))/(IF(STDEV($N$30:N45)<0.01,0.01,STDEV($N$30:N45)))*SQRT(COUNT($N$30:N45))/(2*(COUNT($N$30:N45)-1))))))>1,1,(MAX(0,(0.5-(($AL$21-AVERAGE($N$30:N45))/(IF(STDEV($N$30:N45)<0.01,0.01,STDEV($N$30:N45)))*SQRT(COUNT($N$30:N45))/(2*(COUNT($N$30:N45)-1)))))))","v":{"$error":"#VALUE!"}},0,0,0,0,{"$f":"IF((MAX(0,(0.5-(($AQ$21-AVERAGE($S$30:S45))/(IF(STDEV($S$30:S45)<0.01,0.01,STDEV($S$30:S45)))*SQRT(COUNT($S$30:S45))/(2*(COUNT($S$30:S45)-1))))))>1,1,(MAX(0,(0.5-(($AQ$21-AVERAGE($S$30:S45))/(IF(STDEV($S$30:S45)<0.01,0.01,STDEV($S$30:S45)))*SQRT(COUNT($S$30:S45))/(2*(COUNT($S$30:S45)-1)))))))","v":{"$error":"#VALUE!"}},{"$f":"IF((MAX(0,(0.5-(($AR$21-AVERAGE($T$30:T45))/(IF(STDEV($T$30:T45)<0.01,0.01,STDEV($T$30:T45)))*SQRT(COUNT($T$30:T45))/(2*(COUNT($T$30:T45)-1))))))>1,1,(MAX(0,(0.5-(($AR$21-AVERAGE($T$30:T45))/(IF(STDEV($T$30:T45)<0.01,0.01,STDEV($T$30:T45)))*SQRT(COUNT($T$30:T45))/(2*(COUNT($T$30:T45)-1)))))))","v":{"$error":"#VALUE!"}},{"$f":"IF((MAX(0,(0.5-(($AS$21-AVERAGE($AA$30:AA45))/(IF(STDEV($AA$30:AA45)<0.01,0.01,STDEV($AA$30:AA45)))*SQRT(COUNT($AA$30:AA45))/(2*(COUNT($AA$30:AA45)-1))))))>1,1,(MAX(0,(0.5-(($AS$21-AVERAGE($AA$30:AA45))/(IF(STDEV($AA$30:AA45)<0.01,0.01,STDEV($AA$30:AA45)))*SQRT(COUNT($AA$30:AA45))/(2*(COUNT($AA$30:AA45)-1)))))))","v":{"$error":"#DIV/0!"}},{"$f":"IF((MAX(0,(0.5-(($AT$21-AVERAGE($AB$30:AB45))/(IF(STDEV($AB$30:AB45)<0.01,0.01,STDEV($AB$30:AB45)))*SQRT(COUNT($AB$30:AB45))/(2*(COUNT($AB$30:AB45)-1))))))>1,1,(MAX(0,(0.5-(($AT$21-AVERAGE($AB$30:AB45))/(IF(STDEV($AB$30:AB45)<0.01,0.01,STDEV($AB$30:AB45)))*SQRT(COUNT($AB$30:AB45))/(2*(COUNT($AB$30:AB45)-1)))))))","v":{"$error":"#VALUE!"}},null,{"$f":"IF((MAX(0,(0.5-((AVERAGE($M$30:M45)-$AV$22)/(IF(STDEV($M$30:M45)<0.01,0.01,STDEV($M$30:M45)))*SQRT(COUNT($M$30:M45))/(2*(COUNT($M$30:M45)-1))))))>1,1,(MAX(0,(0.5-((AVERAGE($M$30:M45)-$AV$22)/(IF(STDEV($M$30:M45)<0.01,0.01,STDEV($M$30:M45)))*SQRT(COUNT($M$30:M45))/(2*(COUNT($M$30:M45)-1)))))))","v":{"$error":"#DIV/0!"}},{"$f":"IF((MAX(0,(0.5-((AVERAGE($N$30:N45)-$AW$22)/(IF(STDEV($N$30:N45)<0.01,0.01,STDEV($N$30:N45)))*SQRT(COUNT($N$30:N45))/(2*(COUNT($N$30:N45)-1))))))>1,1,(MAX(0,(0.5-((AVERAGE($N$30:N45)-$AW$22)/(IF(STDEV($N$30:N45)<0.01,0.01,STDEV($N$30:N45)))*SQRT(COUNT($N$30:N45))/(2*(COUNT($N$30:N45)-1)))))))","v":{"$error":"#DIV/0!"}},{"$f":"IF((MAX(0,(0.5-((AVERAGE($S$30:S45)-$AX$22)/(IF(STDEV($S$30:S45)<0.01,0.01,STDEV($S$30:S45)))*SQRT(COUNT($S$30:S45))/(2*(COUNT($S$30:S45)-1))))))>1,1,(MAX(0,(0.5-((AVERAGE($S$30:S45)-$AX$22)/(IF(STDEV($S$30:S45)<0.01,0.01,STDEV($S$30:S45)))*SQRT(COUNT($S$30:S45))/(2*(COUNT($S$30:S45)-1)))))))","v":{"$error":"#DIV/0!"}},{"$f":"IF((MAX(0,(0.5-((AVERAGE($T$30:T45)-$AY$22)/(IF(STDEV($T$30:T45)<0.01,0.01,STDEV($T$30:T45)))*SQRT(COUNT($T$30:T45))/(2*(COUNT($T$30:T45)-1))))))>1,1,(MAX(0,(0.5-((AVERAGE($T$30:T45)-$AY$22)/(IF(STDEV($T$30:T45)<0.01,0.01,STDEV($T$30:T45)))*SQRT(COUNT($T$30:T45))/(2*(COUNT($T$30:T45)-1)))))))","v":{"$error":"#DIV/0!"}},{"$f":"IF((MAX(0,(0.5-((AVERAGE($AA$30:AA45)-$AZ$22)/(IF(STDEV($AA$30:AA45)<0.01,0.01,STDEV($AA$30:AA45)))*SQRT(COUNT($AA$30:AA45))/(2*(COUNT($AA$30:AA45)-1))))))>1,1,(MAX(0,(0.5-((AVERAGE($AA$30:AA45)-$AZ$22)/(IF(STDEV($AA$30:AA45)<0.01,0.01,STDEV($AA$30:AA45)))*SQRT(COUNT($AA$30:AA45))/(2*(COUNT($AA$30:AA45)-1)))))))","v":{"$error":"#DIV/0!"}},{"$f":"IF((MAX(0,(0.5-((AVERAGE($AB$30:AB45)-$BA$22)/(IF(STDEV($AB$30:AB45)<0.01,0.01,STDEV($AB$30:AB45)))*SQRT(COUNT($AB$30:AB45))/(2*(COUNT($AB$30:AB45)-1))))))>1,1,(MAX(0,(0.5-((AVERAGE($AB$30:AB45)-$BA$22)/(IF(STDEV($AB$30:AB45)<0.01,0.01,STDEV($AB$30:AB45)))*SQRT(COUNT($AB$30:AB45))/(2*(COUNT($AB$30:AB45)-1)))))))","v":{"$error":"#DIV/0!"}},null,null,{"$f":"(0.5 * ((100-(BETADIST(AK45,((COUNT(M$30:M45))/2)-1,((COUNT(M$30:M45))/2)-1))*100) + (100-(BETADIST(AV45,((COUNT(M$30:M45))/2)-1,((COUNT(M$30:M45))/2)-1))*100) - 100) + 55) / 100","v":{"$error":"#VALUE!"}},{"$f":"(0.5 * ((100-(BETADIST(AL45,((COUNT(N$30:N45))/2)-1,((COUNT(N$30:N45))/2)-1))*100) + (100-(BETADIST(AW45,((COUNT(N$30:N45))/2)-1,((COUNT(N$30:N45))/2)-1))*100) - 100) + 55) / 100","v":{"$error":"#VALUE!"}},{"$f":"(0.5 * ((100-(BETADIST(AQ45,((COUNT(S$30:S45))/2)-1,((COUNT(S$30:S45))/2)-1))*100) + (100-(BETADIST(AX45,((COUNT(S$30:S45))/2)-1,((COUNT(S$30:S45))/2)-1))*100) - 100) + 55) / 100","v":{"$error":"#VALUE!"}},{"$f":"(0.5 * ((100-(BETADIST(AR45,((COUNT(T$30:T45))/2)-1,((COUNT(T$30:T45))/2)-1))*100) + (100-(BETADIST(AY45,((COUNT(T$30:T45))/2)-1,((COUNT(T$30:T45))/2)-1))*100) - 100) + 55) / 100","v":{"$error":"#VALUE!"}},{"$f":"(0.5 * ((100-(BETADIST(AS45,((COUNT(AA$30:AA45))/2)-1,((COUNT(AA$30:AA45))/2)-1))*100) + (100-(BETADIST(AZ45,((COUNT(AA$30:AA45))/2)-1,((COUNT(AA$30:AA45))/2)-1))*100) - 100) + 55) / 100","v":{"$error":"#DIV/0!"}},{"$f":"(0.5 * ((100-(BETADIST(AT45,((COUNT(AB$30:AB45))/2)-1,((COUNT(AB$30:AB45))/2)-1))*100) + (100-(BETADIST(BA45,((COUNT(AB$30:AB45))/2)-1,((COUNT(AB$30:AB45))/2)-1))*100) - 100) + 55) / 100","v":{"$error":"#VALUE!"}},{"$error":"#VALUE!"},null,null,null,null,null,null,null,null,null,null,null,null,null,null,null,null,null,null,null,null,null,null,null,null,null,null,null,null,null,null,null,null,null,null,null,null,null,null,null,null,null,null,null,"2009-08-23",null,1,16,null,null,null,null,null,null,null,null,38,null,16,null,null,6.8,4.91,94.4,95.6,95.1]
[null,null,null,null,null,null,null,null,null,null,null,null,null,null,null,null,null,null,null,null,null,null,null,null,null,null,"","",null,null,0,0,0,0,0,0,{"$f":"IF((MAX(0,(0.5-(($AK$21-AVERAGE($M$30:M46))/(IF(STDEV($M$30:M46)<0.01,0.01,STDEV($M$30:M46)))*SQRT(COUNT($M$30:M46))/(2*(COUNT($M$30:M46)-1))))))>1,1,(MAX(0,(0.5-(($AK$21-AVERAGE($M$30:M46))/(IF(STDEV($M$30:M46)<0.01,0.01,STDEV($M$30:M46)))*SQRT(COUNT($M$30:M46))/(2*(COUNT($M$30:M46)-1)))))))","v":{"$error":"#VALUE!"}},{"$f":"IF((MAX(0,(0.5-(($AL$21-AVERAGE($N$30:N46))/(IF(STDEV($N$30:N46)<0.01,0.01,STDEV($N$30:N46)))*SQRT(COUNT($N$30:N46))/(2*(COUNT($N$30:N46)-1))))))>1,1,(MAX(0,(0.5-(($AL$21-AVERAGE($N$30:N46))/(IF(STDEV($N$30:N46)<0.01,0.01,STDEV($N$30:N46)))*SQRT(COUNT($N$30:N46))/(2*(COUNT($N$30:N46)-1)))))))","v":{"$error":"#VALUE!"}},0,0,0,0,{"$f":"IF((MAX(0,(0.5-(($AQ$21-AVERAGE($S$30:S46))/(IF(STDEV($S$30:S46)<0.01,0.01,STDEV($S$30:S46)))*SQRT(COUNT($S$30:S46))/(2*(COUNT($S$30:S46)-1))))))>1,1,(MAX(0,(0.5-(($AQ$21-AVERAGE($S$30:S46))/(IF(STDEV($S$30:S46)<0.01,0.01,STDEV($S$30:S46)))*SQRT(COUNT($S$30:S46))/(2*(COUNT($S$30:S46)-1)))))))","v":{"$error":"#VALUE!"}},{"$f":"IF((MAX(0,(0.5-(($AR$21-AVERAGE($T$30:T46))/(IF(STDEV($T$30:T46)<0.01,0.01,STDEV($T$30:T46)))*SQRT(COUNT($T$30:T46))/(2*(COUNT($T$30:T46)-1))))))>1,1,(MAX(0,(0.5-(($AR$21-AVERAGE($T$30:T46))/(IF(STDEV($T$30:T46)<0.01,0.01,STDEV($T$30:T46)))*SQRT(COUNT($T$30:T46))/(2*(COUNT($T$30:T46)-1)))))))","v":{"$error":"#VALUE!"}},{"$f":"IF((MAX(0,(0.5-(($AS$21-AVERAGE($AA$30:AA46))/(IF(STDEV($AA$30:AA46)<0.01,0.01,STDEV($AA$30:AA46)))*SQRT(COUNT($AA$30:AA46))/(2*(COUNT($AA$30:AA46)-1))))))>1,1,(MAX(0,(0.5-(($AS$21-AVERAGE($AA$30:AA46))/(IF(STDEV($AA$30:AA46)<0.01,0.01,STDEV($AA$30:AA46)))*SQRT(COUNT($AA$30:AA46))/(2*(COUNT($AA$30:AA46)-1)))))))","v":{"$error":"#DIV/0!"}},{"$f":"IF((MAX(0,(0.5-(($AT$21-AVERAGE($AB$30:AB46))/(IF(STDEV($AB$30:AB46)<0.01,0.01,STDEV($AB$30:AB46)))*SQRT(COUNT($AB$30:AB46))/(2*(COUNT($AB$30:AB46)-1))))))>1,1,(MAX(0,(0.5-(($AT$21-AVERAGE($AB$30:AB46))/(IF(STDEV($AB$30:AB46)<0.01,0.01,STDEV($AB$30:AB46)))*SQRT(COUNT($AB$30:AB46))/(2*(COUNT($AB$30:AB46)-1)))))))","v":{"$error":"#VALUE!"}},null,{"$f":"IF((MAX(0,(0.5-((AVERAGE($M$30:M46)-$AV$22)/(IF(STDEV($M$30:M46)<0.01,0.01,STDEV($M$30:M46)))*SQRT(COUNT($M$30:M46))/(2*(COUNT($M$30:M46)-1))))))>1,1,(MAX(0,(0.5-((AVERAGE($M$30:M46)-$AV$22)/(IF(STDEV($M$30:M46)<0.01,0.01,STDEV($M$30:M46)))*SQRT(COUNT($M$30:M46))/(2*(COUNT($M$30:M46)-1)))))))","v":{"$error":"#DIV/0!"}},{"$f":"IF((MAX(0,(0.5-((AVERAGE($N$30:N46)-$AW$22)/(IF(STDEV($N$30:N46)<0.01,0.01,STDEV($N$30:N46)))*SQRT(COUNT($N$30:N46))/(2*(COUNT($N$30:N46)-1))))))>1,1,(MAX(0,(0.5-((AVERAGE($N$30:N46)-$AW$22)/(IF(STDEV($N$30:N46)<0.01,0.01,STDEV($N$30:N46)))*SQRT(COUNT($N$30:N46))/(2*(COUNT($N$30:N46)-1)))))))","v":{"$error":"#DIV/0!"}},{"$f":"IF((MAX(0,(0.5-((AVERAGE($S$30:S46)-$AX$22)/(IF(STDEV($S$30:S46)<0.01,0.01,STDEV($S$30:S46)))*SQRT(COUNT($S$30:S46))/(2*(COUNT($S$30:S46)-1))))))>1,1,(MAX(0,(0.5-((AVERAGE($S$30:S46)-$AX$22)/(IF(STDEV($S$30:S46)<0.01,0.01,STDEV($S$30:S46)))*SQRT(COUNT($S$30:S46))/(2*(COUNT($S$30:S46)-1)))))))","v":{"$error":"#DIV/0!"}},{"$f":"IF((MAX(0,(0.5-((AVERAGE($T$30:T46)-$AY$22)/(IF(STDEV($T$30:T46)<0.01,0.01,STDEV($T$30:T46)))*SQRT(COUNT($T$30:T46))/(2*(COUNT($T$30:T46)-1))))))>1,1,(MAX(0,(0.5-((AVERAGE($T$30:T46)-$AY$22)/(IF(STDEV($T$30:T46)<0.01,0.01,STDEV($T$30:T46)))*SQRT(COUNT($T$30:T46))/(2*(COUNT($T$30:T46)-1)))))))","v":{"$error":"#DIV/0!"}},{"$f":"IF((MAX(0,(0.5-((AVERAGE($AA$30:AA46)-$AZ$22)/(IF(STDEV($AA$30:AA46)<0.01,0.01,STDEV($AA$30:AA46)))*SQRT(COUNT($AA$30:AA46))/(2*(COUNT($AA$30:AA46)-1))))))>1,1,(MAX(0,(0.5-((AVERAGE($AA$30:AA46)-$AZ$22)/(IF(STDEV($AA$30:AA46)<0.01,0.01,STDEV($AA$30:AA46)))*SQRT(COUNT($AA$30:AA46))/(2*(COUNT($AA$30:AA46)-1)))))))","v":{"$error":"#DIV/0!"}},{"$f":"IF((MAX(0,(0.5-((AVERAGE($AB$30:AB46)-$BA$22)/(IF(STDEV($AB$30:AB46)<0.01,0.01,STDEV($AB$30:AB46)))*SQRT(COUNT($AB$30:AB46))/(2*(COUNT($AB$30:AB46)-1))))))>1,1,(MAX(0,(0.5-((AVERAGE($AB$30:AB46)-$BA$22)/(IF(STDEV($AB$30:AB46)<0.01,0.01,STDEV($AB$30:AB46)))*SQRT(COUNT($AB$30:AB46))/(2*(COUNT($AB$30:AB46)-1)))))))","v":{"$error":"#DIV/0!"}},null,null,{"$f":"(0.5 * ((100-(BETADIST(AK46,((COUNT(M$30:M46))/2)-1,((COUNT(M$30:M46))/2)-1))*100) + (100-(BETADIST(AV46,((COUNT(M$30:M46))/2)-1,((COUNT(M$30:M46))/2)-1))*100) - 100) + 55) / 100","v":{"$error":"#VALUE!"}},{"$f":"(0.5 * ((100-(BETADIST(AL46,((COUNT(N$30:N46))/2)-1,((COUNT(N$30:N46))/2)-1))*100) + (100-(BETADIST(AW46,((COUNT(N$30:N46))/2)-1,((COUNT(N$30:N46))/2)-1))*100) - 100) + 55) / 100","v":{"$error":"#VALUE!"}},{"$f":"(0.5 * ((100-(BETADIST(AQ46,((COUNT(S$30:S46))/2)-1,((COUNT(S$30:S46))/2)-1))*100) + (100-(BETADIST(AX46,((COUNT(S$30:S46))/2)-1,((COUNT(S$30:S46))/2)-1))*100) - 100) + 55) / 100","v":{"$error":"#VALUE!"}},{"$f":"(0.5 * ((100-(BETADIST(AR46,((COUNT(T$30:T46))/2)-1,((COUNT(T$30:T46))/2)-1))*100) + (100-(BETADIST(AY46,((COUNT(T$30:T46))/2)-1,((COUNT(T$30:T46))/2)-1))*100) - 100) + 55) / 100","v":{"$error":"#VALUE!"}},{"$f":"(0.5 * ((100-(BETADIST(AS46,((COUNT(AA$30:AA46))/2)-1,((COUNT(AA$30:AA46))/2)-1))*100) + (100-(BETADIST(AZ46,((COUNT(AA$30:AA46))/2)-1,((COUNT(AA$30:AA46))/2)-1))*100) - 100) + 55) / 100","v":{"$error":"#DIV/0!"}},{"$f":"(0.5 * ((100-(BETADIST(AT46,((COUNT(AB$30:AB46))/2)-1,((COUNT(AB$30:AB46))/2)-1))*100) + (100-(BETADIST(BA46,((COUNT(AB$30:AB46))/2)-1,((COUNT(AB$30:AB46))/2)-1))*100) - 100) + 55) / 100","v":{"$error":"#VALUE!"}},{"$error":"#VALUE!"},null,null,null,null,null,null,null,null,null,null,null,null,null,null,null,null,null,null,null,null,null,null,null,null,null,null,null,null,null,null,null,null,null,null,null,null,null,null,null,null,null,null,null,null,null,1,17,null,null,null,null,null,null,null,null,36,null,15,null,null,6.5,5.05,96.3,96.2,91.7,3.2,3.3,3.4]
[null,null,null,null,null,null,null,null,null,null,null,null,null,null,null,null,null,null,null,null,null,null,null,null,null,null,"","",null,null,0,0,0,0,0,0,{"$f":"IF((MAX(0,(0.5-(($AK$21-AVERAGE($M$30:M47))/(IF(STDEV($M$30:M47)<0.01,0.01,STDEV($M$30:M47)))*SQRT(COUNT($M$30:M47))/(2*(COUNT($M$30:M47)-1))))))>1,1,(MAX(0,(0.5-(($AK$21-AVERAGE($M$30:M47))/(IF(STDEV($M$30:M47)<0.01,0.01,STDEV($M$30:M47)))*SQRT(COUNT($M$30:M47))/(2*(COUNT($M$30:M47)-1)))))))","v":{"$error":"#VALUE!"}},{"$f":"IF((MAX(0,(0.5-(($AL$21-AVERAGE($N$30:N47))/(IF(STDEV($N$30:N47)<0.01,0.01,STDEV($N$30:N47)))*SQRT(COUNT($N$30:N47))/(2*(COUNT($N$30:N47)-1))))))>1,1,(MAX(0,(0.5-(($AL$21-AVERAGE($N$30:N47))/(IF(STDEV($N$30:N47)<0.01,0.01,STDEV($N$30:N47)))*SQRT(COUNT($N$30:N47))/(2*(COUNT($N$30:N47)-1)))))))","v":{"$error":"#VALUE!"}},0,0,0,0,{"$f":"IF((MAX(0,(0.5-(($AQ$21-AVERAGE($S$30:S47))/(IF(STDEV($S$30:S47)<0.01,0.01,STDEV($S$30:S47)))*SQRT(COUNT($S$30:S47))/(2*(COUNT($S$30:S47)-1))))))>1,1,(MAX(0,(0.5-(($AQ$21-AVERAGE($S$30:S47))/(IF(STDEV($S$30:S47)<0.01,0.01,STDEV($S$30:S47)))*SQRT(COUNT($S$30:S47))/(2*(COUNT($S$30:S47)-1)))))))","v":{"$error":"#VALUE!"}},{"$f":"IF((MAX(0,(0.5-(($AR$21-AVERAGE($T$30:T47))/(IF(STDEV($T$30:T47)<0.01,0.01,STDEV($T$30:T47)))*SQRT(COUNT($T$30:T47))/(2*(COUNT($T$30:T47)-1))))))>1,1,(MAX(0,(0.5-(($AR$21-AVERAGE($T$30:T47))/(IF(STDEV($T$30:T47)<0.01,0.01,STDEV($T$30:T47)))*SQRT(COUNT($T$30:T47))/(2*(COUNT($T$30:T47)-1)))))))","v":{"$error":"#VALUE!"}},{"$f":"IF((MAX(0,(0.5-(($AS$21-AVERAGE($AA$30:AA47))/(IF(STDEV($AA$30:AA47)<0.01,0.01,STDEV($AA$30:AA47)))*SQRT(COUNT($AA$30:AA47))/(2*(COUNT($AA$30:AA47)-1))))))>1,1,(MAX(0,(0.5-(($AS$21-AVERAGE($AA$30:AA47))/(IF(STDEV($AA$30:AA47)<0.01,0.01,STDEV($AA$30:AA47)))*SQRT(COUNT($AA$30:AA47))/(2*(COUNT($AA$30:AA47)-1)))))))","v":{"$error":"#DIV/0!"}},{"$f":"IF((MAX(0,(0.5-(($AT$21-AVERAGE($AB$30:AB47))/(IF(STDEV($AB$30:AB47)<0.01,0.01,STDEV($AB$30:AB47)))*SQRT(COUNT($AB$30:AB47))/(2*(COUNT($AB$30:AB47)-1))))))>1,1,(MAX(0,(0.5-(($AT$21-AVERAGE($AB$30:AB47))/(IF(STDEV($AB$30:AB47)<0.01,0.01,STDEV($AB$30:AB47)))*SQRT(COUNT($AB$30:AB47))/(2*(COUNT($AB$30:AB47)-1)))))))","v":{"$error":"#VALUE!"}},null,{"$f":"IF((MAX(0,(0.5-((AVERAGE($M$30:M47)-$AV$22)/(IF(STDEV($M$30:M47)<0.01,0.01,STDEV($M$30:M47)))*SQRT(COUNT($M$30:M47))/(2*(COUNT($M$30:M47)-1))))))>1,1,(MAX(0,(0.5-((AVERAGE($M$30:M47)-$AV$22)/(IF(STDEV($M$30:M47)<0.01,0.01,STDEV($M$30:M47)))*SQRT(COUNT($M$30:M47))/(2*(COUNT($M$30:M47)-1)))))))","v":{"$error":"#DIV/0!"}},{"$f":"IF((MAX(0,(0.5-((AVERAGE($N$30:N47)-$AW$22)/(IF(STDEV($N$30:N47)<0.01,0.01,STDEV($N$30:N47)))*SQRT(COUNT($N$30:N47))/(2*(COUNT($N$30:N47)-1))))))>1,1,(MAX(0,(0.5-((AVERAGE($N$30:N47)-$AW$22)/(IF(STDEV($N$30:N47)<0.01,0.01,STDEV($N$30:N47)))*SQRT(COUNT($N$30:N47))/(2*(COUNT($N$30:N47)-1)))))))","v":{"$error":"#DIV/0!"}},{"$f":"IF((MAX(0,(0.5-((AVERAGE($S$30:S47)-$AX$22)/(IF(STDEV($S$30:S47)<0.01,0.01,STDEV($S$30:S47)))*SQRT(COUNT($S$30:S47))/(2*(COUNT($S$30:S47)-1))))))>1,1,(MAX(0,(0.5-((AVERAGE($S$30:S47)-$AX$22)/(IF(STDEV($S$30:S47)<0.01,0.01,STDEV($S$30:S47)))*SQRT(COUNT($S$30:S47))/(2*(COUNT($S$30:S47)-1)))))))","v":{"$error":"#DIV/0!"}},{"$f":"IF((MAX(0,(0.5-((AVERAGE($T$30:T47)-$AY$22)/(IF(STDEV($T$30:T47)<0.01,0.01,STDEV($T$30:T47)))*SQRT(COUNT($T$30:T47))/(2*(COUNT($T$30:T47)-1))))))>1,1,(MAX(0,(0.5-((AVERAGE($T$30:T47)-$AY$22)/(IF(STDEV($T$30:T47)<0.01,0.01,STDEV($T$30:T47)))*SQRT(COUNT($T$30:T47))/(2*(COUNT($T$30:T47)-1)))))))","v":{"$error":"#DIV/0!"}},{"$f":"IF((MAX(0,(0.5-((AVERAGE($AA$30:AA47)-$AZ$22)/(IF(STDEV($AA$30:AA47)<0.01,0.01,STDEV($AA$30:AA47)))*SQRT(COUNT($AA$30:AA47))/(2*(COUNT($AA$30:AA47)-1))))))>1,1,(MAX(0,(0.5-((AVERAGE($AA$30:AA47)-$AZ$22)/(IF(STDEV($AA$30:AA47)<0.01,0.01,STDEV($AA$30:AA47)))*SQRT(COUNT($AA$30:AA47))/(2*(COUNT($AA$30:AA47)-1)))))))","v":{"$error":"#DIV/0!"}},{"$f":"IF((MAX(0,(0.5-((AVERAGE($AB$30:AB47)-$BA$22)/(IF(STDEV($AB$30:AB47)<0.01,0.01,STDEV($AB$30:AB47)))*SQRT(COUNT($AB$30:AB47))/(2*(COUNT($AB$30:AB47)-1))))))>1,1,(MAX(0,(0.5-((AVERAGE($AB$30:AB47)-$BA$22)/(IF(STDEV($AB$30:AB47)<0.01,0.01,STDEV($AB$30:AB47)))*SQRT(COUNT($AB$30:AB47))/(2*(COUNT($AB$30:AB47)-1)))))))","v":{"$error":"#DIV/0!"}},null,null,{"$f":"(0.5 * ((100-(BETADIST(AK47,((COUNT(M$30:M47))/2)-1,((COUNT(M$30:M47))/2)-1))*100) + (100-(BETADIST(AV47,((COUNT(M$30:M47))/2)-1,((COUNT(M$30:M47))/2)-1))*100) - 100) + 55) / 100","v":{"$error":"#VALUE!"}},{"$f":"(0.5 * ((100-(BETADIST(AL47,((COUNT(N$30:N47))/2)-1,((COUNT(N$30:N47))/2)-1))*100) + (100-(BETADIST(AW47,((COUNT(N$30:N47))/2)-1,((COUNT(N$30:N47))/2)-1))*100) - 100) + 55) / 100","v":{"$error":"#VALUE!"}},{"$f":"(0.5 * ((100-(BETADIST(AQ47,((COUNT(S$30:S47))/2)-1,((COUNT(S$30:S47))/2)-1))*100) + (100-(BETADIST(AX47,((COUNT(S$30:S47))/2)-1,((COUNT(S$30:S47))/2)-1))*100) - 100) + 55) / 100","v":{"$error":"#VALUE!"}},{"$f":"(0.5 * ((100-(BETADIST(AR47,((COUNT(T$30:T47))/2)-1,((COUNT(T$30:T47))/2)-1))*100) + (100-(BETADIST(AY47,((COUNT(T$30:T47))/2)-1,((COUNT(T$30:T47))/2)-1))*100) - 100) + 55) / 100","v":{"$error":"#VALUE!"}},{"$f":"(0.5 * ((100-(BETADIST(AS47,((COUNT(AA$30:AA47))/2)-1,((COUNT(AA$30:AA47))/2)-1))*100) + (100-(BETADIST(AZ47,((COUNT(AA$30:AA47))/2)-1,((COUNT(AA$30:AA47))/2)-1))*100) - 100) + 55) / 100","v":{"$error":"#DIV/0!"}},{"$f":"(0.5 * ((100-(BETADIST(AT47,((COUNT(AB$30:AB47))/2)-1,((COUNT(AB$30:AB47))/2)-1))*100) + (100-(BETADIST(BA47,((COUNT(AB$30:AB47))/2)-1,((COUNT(AB$30:AB47))/2)-1))*100) - 100) + 55) / 100","v":{"$error":"#VALUE!"}},{"$error":"#VALUE!"},null,null,null,null,null,null,null,null,null,null,null,null,null,null,null,null,null,null,null,null,null,null,null,null,null,null,null,null,null,null,null,null,null,null,null,null,null,null,null,null,null,null,null,null,null,1,18,null,null,null,null,null,null,null,null,37,null,14,null,null,6.6,5.03,91.5,92.5,92.9]
[null,null,null,null,null,null,null,null,null,null,null,null,null,null,null,null,null,null,null,null,null,null,null,null,null,null,"","",null,null,0,0,0,0,0,0,{"$f":"IF((MAX(0,(0.5-(($AK$21-AVERAGE($M$30:M48))/(IF(STDEV($M$30:M48)<0.01,0.01,STDEV($M$30:M48)))*SQRT(COUNT($M$30:M48))/(2*(COUNT($M$30:M48)-1))))))>1,1,(MAX(0,(0.5-(($AK$21-AVERAGE($M$30:M48))/(IF(STDEV($M$30:M48)<0.01,0.01,STDEV($M$30:M48)))*SQRT(COUNT($M$30:M48))/(2*(COUNT($M$30:M48)-1)))))))","v":{"$error":"#VALUE!"}},{"$f":"IF((MAX(0,(0.5-(($AL$21-AVERAGE($N$30:N48))/(IF(STDEV($N$30:N48)<0.01,0.01,STDEV($N$30:N48)))*SQRT(COUNT($N$30:N48))/(2*(COUNT($N$30:N48)-1))))))>1,1,(MAX(0,(0.5-(($AL$21-AVERAGE($N$30:N48))/(IF(STDEV($N$30:N48)<0.01,0.01,STDEV($N$30:N48)))*SQRT(COUNT($N$30:N48))/(2*(COUNT($N$30:N48)-1)))))))","v":{"$error":"#VALUE!"}},0,0,0,0,{"$f":"IF((MAX(0,(0.5-(($AQ$21-AVERAGE($S$30:S48))/(IF(STDEV($S$30:S48)<0.01,0.01,STDEV($S$30:S48)))*SQRT(COUNT($S$30:S48))/(2*(COUNT($S$30:S48)-1))))))>1,1,(MAX(0,(0.5-(($AQ$21-AVERAGE($S$30:S48))/(IF(STDEV($S$30:S48)<0.01,0.01,STDEV($S$30:S48)))*SQRT(COUNT($S$30:S48))/(2*(COUNT($S$30:S48)-1)))))))","v":{"$error":"#VALUE!"}},{"$f":"IF((MAX(0,(0.5-(($AR$21-AVERAGE($T$30:T48))/(IF(STDEV($T$30:T48)<0.01,0.01,STDEV($T$30:T48)))*SQRT(COUNT($T$30:T48))/(2*(COUNT($T$30:T48)-1))))))>1,1,(MAX(0,(0.5-(($AR$21-AVERAGE($T$30:T48))/(IF(STDEV($T$30:T48)<0.01,0.01,STDEV($T$30:T48)))*SQRT(COUNT($T$30:T48))/(2*(COUNT($T$30:T48)-1)))))))","v":{"$error":"#VALUE!"}},{"$f":"IF((MAX(0,(0.5-(($AS$21-AVERAGE($AA$30:AA48))/(IF(STDEV($AA$30:AA48)<0.01,0.01,STDEV($AA$30:AA48)))*SQRT(COUNT($AA$30:AA48))/(2*(COUNT($AA$30:AA48)-1))))))>1,1,(MAX(0,(0.5-(($AS$21-AVERAGE($AA$30:AA48))/(IF(STDEV($AA$30:AA48)<0.01,0.01,STDEV($AA$30:AA48)))*SQRT(COUNT($AA$30:AA48))/(2*(COUNT($AA$30:AA48)-1)))))))","v":{"$error":"#DIV/0!"}},{"$f":"IF((MAX(0,(0.5-(($AT$21-AVERAGE($AB$30:AB48))/(IF(STDEV($AB$30:AB48)<0.01,0.01,STDEV($AB$30:AB48)))*SQRT(COUNT($AB$30:AB48))/(2*(COUNT($AB$30:AB48)-1))))))>1,1,(MAX(0,(0.5-(($AT$21-AVERAGE($AB$30:AB48))/(IF(STDEV($AB$30:AB48)<0.01,0.01,STDEV($AB$30:AB48)))*SQRT(COUNT($AB$30:AB48))/(2*(COUNT($AB$30:AB48)-1)))))))","v":{"$error":"#VALUE!"}},null,{"$f":"IF((MAX(0,(0.5-((AVERAGE($M$30:M48)-$AV$22)/(IF(STDEV($M$30:M48)<0.01,0.01,STDEV($M$30:M48)))*SQRT(COUNT($M$30:M48))/(2*(COUNT($M$30:M48)-1))))))>1,1,(MAX(0,(0.5-((AVERAGE($M$30:M48)-$AV$22)/(IF(STDEV($M$30:M48)<0.01,0.01,STDEV($M$30:M48)))*SQRT(COUNT($M$30:M48))/(2*(COUNT($M$30:M48)-1)))))))","v":{"$error":"#DIV/0!"}},{"$f":"IF((MAX(0,(0.5-((AVERAGE($N$30:N48)-$AW$22)/(IF(STDEV($N$30:N48)<0.01,0.01,STDEV($N$30:N48)))*SQRT(COUNT($N$30:N48))/(2*(COUNT($N$30:N48)-1))))))>1,1,(MAX(0,(0.5-((AVERAGE($N$30:N48)-$AW$22)/(IF(STDEV($N$30:N48)<0.01,0.01,STDEV($N$30:N48)))*SQRT(COUNT($N$30:N48))/(2*(COUNT($N$30:N48)-1)))))))","v":{"$error":"#DIV/0!"}},{"$f":"IF((MAX(0,(0.5-((AVERAGE($S$30:S48)-$AX$22)/(IF(STDEV($S$30:S48)<0.01,0.01,STDEV($S$30:S48)))*SQRT(COUNT($S$30:S48))/(2*(COUNT($S$30:S48)-1))))))>1,1,(MAX(0,(0.5-((AVERAGE($S$30:S48)-$AX$22)/(IF(STDEV($S$30:S48)<0.01,0.01,STDEV($S$30:S48)))*SQRT(COUNT($S$30:S48))/(2*(COUNT($S$30:S48)-1)))))))","v":{"$error":"#DIV/0!"}},{"$f":"IF((MAX(0,(0.5-((AVERAGE($T$30:T48)-$AY$22)/(IF(STDEV($T$30:T48)<0.01,0.01,STDEV($T$30:T48)))*SQRT(COUNT($T$30:T48))/(2*(COUNT($T$30:T48)-1))))))>1,1,(MAX(0,(0.5-((AVERAGE($T$30:T48)-$AY$22)/(IF(STDEV($T$30:T48)<0.01,0.01,STDEV($T$30:T48)))*SQRT(COUNT($T$30:T48))/(2*(COUNT($T$30:T48)-1)))))))","v":{"$error":"#DIV/0!"}},{"$f":"IF((MAX(0,(0.5-((AVERAGE($AA$30:AA48)-$AZ$22)/(IF(STDEV($AA$30:AA48)<0.01,0.01,STDEV($AA$30:AA48)))*SQRT(COUNT($AA$30:AA48))/(2*(COUNT($AA$30:AA48)-1))))))>1,1,(MAX(0,(0.5-((AVERAGE($AA$30:AA48)-$AZ$22)/(IF(STDEV($AA$30:AA48)<0.01,0.01,STDEV($AA$30:AA48)))*SQRT(COUNT($AA$30:AA48))/(2*(COUNT($AA$30:AA48)-1)))))))","v":{"$error":"#DIV/0!"}},{"$f":"IF((MAX(0,(0.5-((AVERAGE($AB$30:AB48)-$BA$22)/(IF(STDEV($AB$30:AB48)<0.01,0.01,STDEV($AB$30:AB48)))*SQRT(COUNT($AB$30:AB48))/(2*(COUNT($AB$30:AB48)-1))))))>1,1,(MAX(0,(0.5-((AVERAGE($AB$30:AB48)-$BA$22)/(IF(STDEV($AB$30:AB48)<0.01,0.01,STDEV($AB$30:AB48)))*SQRT(COUNT($AB$30:AB48))/(2*(COUNT($AB$30:AB48)-1)))))))","v":{"$error":"#DIV/0!"}},null,null,{"$f":"(0.5 * ((100-(BETADIST(AK48,((COUNT(M$30:M48))/2)-1,((COUNT(M$30:M48))/2)-1))*100) + (100-(BETADIST(AV48,((COUNT(M$30:M48))/2)-1,((COUNT(M$30:M48))/2)-1))*100) - 100) + 55) / 100","v":{"$error":"#VALUE!"}},{"$f":"(0.5 * ((100-(BETADIST(AL48,((COUNT(N$30:N48))/2)-1,((COUNT(N$30:N48))/2)-1))*100) + (100-(BETADIST(AW48,((COUNT(N$30:N48))/2)-1,((COUNT(N$30:N48))/2)-1))*100) - 100) + 55) / 100","v":{"$error":"#VALUE!"}},{"$f":"(0.5 * ((100-(BETADIST(AQ48,((COUNT(S$30:S48))/2)-1,((COUNT(S$30:S48))/2)-1))*100) + (100-(BETADIST(AX48,((COUNT(S$30:S48))/2)-1,((COUNT(S$30:S48))/2)-1))*100) - 100) + 55) / 100","v":{"$error":"#VALUE!"}},{"$f":"(0.5 * ((100-(BETADIST(AR48,((COUNT(T$30:T48))/2)-1,((COUNT(T$30:T48))/2)-1))*100) + (100-(BETADIST(AY48,((COUNT(T$30:T48))/2)-1,((COUNT(T$30:T48))/2)-1))*100) - 100) + 55) / 100","v":{"$error":"#VALUE!"}},{"$f":"(0.5 * ((100-(BETADIST(AS48,((COUNT(AA$30:AA48))/2)-1,((COUNT(AA$30:AA48))/2)-1))*100) + (100-(BETADIST(AZ48,((COUNT(AA$30:AA48))/2)-1,((COUNT(AA$30:AA48))/2)-1))*100) - 100) + 55) / 100","v":{"$error":"#DIV/0!"}},{"$f":"(0.5 * ((100-(BETADIST(AT48,((COUNT(AB$30:AB48))/2)-1,((COUNT(AB$30:AB48))/2)-1))*100) + (100-(BETADIST(BA48,((COUNT(AB$30:AB48))/2)-1,((COUNT(AB$30:AB48))/2)-1))*100) - 100) + 55) / 100","v":{"$error":"#VALUE!"}},{"$error":"#VALUE!"},null,null,null,null,null,null,null,null,null,null,null,null,null,null,null,null,null,null,null,null,null,null,null,null,null,null,null,null,null,null,null,null,null,null,null,null,null,null,null,null,null,null,null,"2009-08-30",null,1,19,"YES",null,null,null,null,null,null,null,38,null,13,null,null,7,5.15,92.5,93.5,93.7,1.5,1.6,1.7]
[null,null,null,null,null,null,null,null,null,null,null,null,null,null,null,null,null,null,null,null,null,null,null,null,null,null,"","",null,null,0,0,0,0,0,0,{"$f":"IF((MAX(0,(0.5-(($AK$21-AVERAGE($M$30:M49))/(IF(STDEV($M$30:M49)<0.01,0.01,STDEV($M$30:M49)))*SQRT(COUNT($M$30:M49))/(2*(COUNT($M$30:M49)-1))))))>1,1,(MAX(0,(0.5-(($AK$21-AVERAGE($M$30:M49))/(IF(STDEV($M$30:M49)<0.01,0.01,STDEV($M$30:M49)))*SQRT(COUNT($M$30:M49))/(2*(COUNT($M$30:M49)-1)))))))","v":{"$error":"#VALUE!"}},{"$f":"IF((MAX(0,(0.5-(($AL$21-AVERAGE($N$30:N49))/(IF(STDEV($N$30:N49)<0.01,0.01,STDEV($N$30:N49)))*SQRT(COUNT($N$30:N49))/(2*(COUNT($N$30:N49)-1))))))>1,1,(MAX(0,(0.5-(($AL$21-AVERAGE($N$30:N49))/(IF(STDEV($N$30:N49)<0.01,0.01,STDEV($N$30:N49)))*SQRT(COUNT($N$30:N49))/(2*(COUNT($N$30:N49)-1)))))))","v":{"$error":"#VALUE!"}},0,0,0,0,{"$f":"IF((MAX(0,(0.5-(($AQ$21-AVERAGE($S$30:S49))/(IF(STDEV($S$30:S49)<0.01,0.01,STDEV($S$30:S49)))*SQRT(COUNT($S$30:S49))/(2*(COUNT($S$30:S49)-1))))))>1,1,(MAX(0,(0.5-(($AQ$21-AVERAGE($S$30:S49))/(IF(STDEV($S$30:S49)<0.01,0.01,STDEV($S$30:S49)))*SQRT(COUNT($S$30:S49))/(2*(COUNT($S$30:S49)-1)))))))","v":{"$error":"#VALUE!"}},{"$f":"IF((MAX(0,(0.5-(($AR$21-AVERAGE($T$30:T49))/(IF(STDEV($T$30:T49)<0.01,0.01,STDEV($T$30:T49)))*SQRT(COUNT($T$30:T49))/(2*(COUNT($T$30:T49)-1))))))>1,1,(MAX(0,(0.5-(($AR$21-AVERAGE($T$30:T49))/(IF(STDEV($T$30:T49)<0.01,0.01,STDEV($T$30:T49)))*SQRT(COUNT($T$30:T49))/(2*(COUNT($T$30:T49)-1)))))))","v":{"$error":"#VALUE!"}},{"$f":"IF((MAX(0,(0.5-(($AS$21-AVERAGE($AA$30:AA49))/(IF(STDEV($AA$30:AA49)<0.01,0.01,STDEV($AA$30:AA49)))*SQRT(COUNT($AA$30:AA49))/(2*(COUNT($AA$30:AA49)-1))))))>1,1,(MAX(0,(0.5-(($AS$21-AVERAGE($AA$30:AA49))/(IF(STDEV($AA$30:AA49)<0.01,0.01,STDEV($AA$30:AA49)))*SQRT(COUNT($AA$30:AA49))/(2*(COUNT($AA$30:AA49)-1)))))))","v":{"$error":"#DIV/0!"}},{"$f":"IF((MAX(0,(0.5-(($AT$21-AVERAGE($AB$30:AB49))/(IF(STDEV($AB$30:AB49)<0.01,0.01,STDEV($AB$30:AB49)))*SQRT(COUNT($AB$30:AB49))/(2*(COUNT($AB$30:AB49)-1))))))>1,1,(MAX(0,(0.5-(($AT$21-AVERAGE($AB$30:AB49))/(IF(STDEV($AB$30:AB49)<0.01,0.01,STDEV($AB$30:AB49)))*SQRT(COUNT($AB$30:AB49))/(2*(COUNT($AB$30:AB49)-1)))))))","v":{"$error":"#VALUE!"}},null,{"$f":"IF((MAX(0,(0.5-((AVERAGE($M$30:M49)-$AV$22)/(IF(STDEV($M$30:M49)<0.01,0.01,STDEV($M$30:M49)))*SQRT(COUNT($M$30:M49))/(2*(COUNT($M$30:M49)-1))))))>1,1,(MAX(0,(0.5-((AVERAGE($M$30:M49)-$AV$22)/(IF(STDEV($M$30:M49)<0.01,0.01,STDEV($M$30:M49)))*SQRT(COUNT($M$30:M49))/(2*(COUNT($M$30:M49)-1)))))))","v":{"$error":"#DIV/0!"}},{"$f":"IF((MAX(0,(0.5-((AVERAGE($N$30:N49)-$AW$22)/(IF(STDEV($N$30:N49)<0.01,0.01,STDEV($N$30:N49)))*SQRT(COUNT($N$30:N49))/(2*(COUNT($N$30:N49)-1))))))>1,1,(MAX(0,(0.5-((AVERAGE($N$30:N49)-$AW$22)/(IF(STDEV($N$30:N49)<0.01,0.01,STDEV($N$30:N49)))*SQRT(COUNT($N$30:N49))/(2*(COUNT($N$30:N49)-1)))))))","v":{"$error":"#DIV/0!"}},{"$f":"IF((MAX(0,(0.5-((AVERAGE($S$30:S49)-$AX$22)/(IF(STDEV($S$30:S49)<0.01,0.01,STDEV($S$30:S49)))*SQRT(COUNT($S$30:S49))/(2*(COUNT($S$30:S49)-1))))))>1,1,(MAX(0,(0.5-((AVERAGE($S$30:S49)-$AX$22)/(IF(STDEV($S$30:S49)<0.01,0.01,STDEV($S$30:S49)))*SQRT(COUNT($S$30:S49))/(2*(COUNT($S$30:S49)-1)))))))","v":{"$error":"#DIV/0!"}},{"$f":"IF((MAX(0,(0.5-((AVERAGE($T$30:T49)-$AY$22)/(IF(STDEV($T$30:T49)<0.01,0.01,STDEV($T$30:T49)))*SQRT(COUNT($T$30:T49))/(2*(COUNT($T$30:T49)-1))))))>1,1,(MAX(0,(0.5-((AVERAGE($T$30:T49)-$AY$22)/(IF(STDEV($T$30:T49)<0.01,0.01,STDEV($T$30:T49)))*SQRT(COUNT($T$30:T49))/(2*(COUNT($T$30:T49)-1)))))))","v":{"$error":"#DIV/0!"}},{"$f":"IF((MAX(0,(0.5-((AVERAGE($AA$30:AA49)-$AZ$22)/(IF(STDEV($AA$30:AA49)<0.01,0.01,STDEV($AA$30:AA49)))*SQRT(COUNT($AA$30:AA49))/(2*(COUNT($AA$30:AA49)-1))))))>1,1,(MAX(0,(0.5-((AVERAGE($AA$30:AA49)-$AZ$22)/(IF(STDEV($AA$30:AA49)<0.01,0.01,STDEV($AA$30:AA49)))*SQRT(COUNT($AA$30:AA49))/(2*(COUNT($AA$30:AA49)-1)))))))","v":{"$error":"#DIV/0!"}},{"$f":"IF((MAX(0,(0.5-((AVERAGE($AB$30:AB49)-$BA$22)/(IF(STDEV($AB$30:AB49)<0.01,0.01,STDEV($AB$30:AB49)))*SQRT(COUNT($AB$30:AB49))/(2*(COUNT($AB$30:AB49)-1))))))>1,1,(MAX(0,(0.5-((AVERAGE($AB$30:AB49)-$BA$22)/(IF(STDEV($AB$30:AB49)<0.01,0.01,STDEV($AB$30:AB49)))*SQRT(COUNT($AB$30:AB49))/(2*(COUNT($AB$30:AB49)-1)))))))","v":{"$error":"#DIV/0!"}},null,null,{"$f":"(0.5 * ((100-(BETADIST(AK49,((COUNT(M$30:M49))/2)-1,((COUNT(M$30:M49))/2)-1))*100) + (100-(BETADIST(AV49,((COUNT(M$30:M49))/2)-1,((COUNT(M$30:M49))/2)-1))*100) - 100) + 55) / 100","v":{"$error":"#VALUE!"}},{"$f":"(0.5 * ((100-(BETADIST(AL49,((COUNT(N$30:N49))/2)-1,((COUNT(N$30:N49))/2)-1))*100) + (100-(BETADIST(AW49,((COUNT(N$30:N49))/2)-1,((COUNT(N$30:N49))/2)-1))*100) - 100) + 55) / 100","v":{"$error":"#VALUE!"}},{"$f":"(0.5 * ((100-(BETADIST(AQ49,((COUNT(S$30:S49))/2)-1,((COUNT(S$30:S49))/2)-1))*100) + (100-(BETADIST(AX49,((COUNT(S$30:S49))/2)-1,((COUNT(S$30:S49))/2)-1))*100) - 100) + 55) / 100","v":{"$error":"#VALUE!"}},{"$f":"(0.5 * ((100-(BETADIST(AR49,((COUNT(T$30:T49))/2)-1,((COUNT(T$30:T49))/2)-1))*100) + (100-(BETADIST(AY49,((COUNT(T$30:T49))/2)-1,((COUNT(T$30:T49))/2)-1))*100) - 100) + 55) / 100","v":{"$error":"#VALUE!"}},{"$f":"(0.5 * ((100-(BETADIST(AS49,((COUNT(AA$30:AA49))/2)-1,((COUNT(AA$30:AA49))/2)-1))*100) + (100-(BETADIST(AZ49,((COUNT(AA$30:AA49))/2)-1,((COUNT(AA$30:AA49))/2)-1))*100) - 100) + 55) / 100","v":{"$error":"#DIV/0!"}},{"$f":"(0.5 * ((100-(BETADIST(AT49,((COUNT(AB$30:AB49))/2)-1,((COUNT(AB$30:AB49))/2)-1))*100) + (100-(BETADIST(BA49,((COUNT(AB$30:AB49))/2)-1,((COUNT(AB$30:AB49))/2)-1))*100) - 100) + 55) / 100","v":{"$error":"#VALUE!"}},{"$error":"#VALUE!"},null,null,null,null,null,null,null,null,null,null,null,null,null,null,null,null,null,null,null,null,null,null,null,null,null,null,null,null,null,null,null,null,null,null,null,null,null,null,null,null,null,null,null,null,null,1,20,null,null,null,null,null,null,null,null,32,null,12,null,null,5.2,5.0999999999999996,91.5,94.2,92.2]
[null,null,null,null,null,null,null,null,null,null,null,null,null,null,null,null,null,null,null,null,null,null,null,null,null,null,"","",null,null,0,0,0,0,0,0,{"$f":"IF((MAX(0,(0.5-(($AK$21-AVERAGE($M$30:M50))/(IF(STDEV($M$30:M50)<0.01,0.01,STDEV($M$30:M50)))*SQRT(COUNT($M$30:M50))/(2*(COUNT($M$30:M50)-1))))))>1,1,(MAX(0,(0.5-(($AK$21-AVERAGE($M$30:M50))/(IF(STDEV($M$30:M50)<0.01,0.01,STDEV($M$30:M50)))*SQRT(COUNT($M$30:M50))/(2*(COUNT($M$30:M50)-1)))))))","v":{"$error":"#VALUE!"}},{"$f":"IF((MAX(0,(0.5-(($AL$21-AVERAGE($N$30:N50))/(IF(STDEV($N$30:N50)<0.01,0.01,STDEV($N$30:N50)))*SQRT(COUNT($N$30:N50))/(2*(COUNT($N$30:N50)-1))))))>1,1,(MAX(0,(0.5-(($AL$21-AVERAGE($N$30:N50))/(IF(STDEV($N$30:N50)<0.01,0.01,STDEV($N$30:N50)))*SQRT(COUNT($N$30:N50))/(2*(COUNT($N$30:N50)-1)))))))","v":{"$error":"#VALUE!"}},0,0,0,0,{"$f":"IF((MAX(0,(0.5-(($AQ$21-AVERAGE($S$30:S50))/(IF(STDEV($S$30:S50)<0.01,0.01,STDEV($S$30:S50)))*SQRT(COUNT($S$30:S50))/(2*(COUNT($S$30:S50)-1))))))>1,1,(MAX(0,(0.5-(($AQ$21-AVERAGE($S$30:S50))/(IF(STDEV($S$30:S50)<0.01,0.01,STDEV($S$30:S50)))*SQRT(COUNT($S$30:S50))/(2*(COUNT($S$30:S50)-1)))))))","v":{"$error":"#VALUE!"}},{"$f":"IF((MAX(0,(0.5-(($AR$21-AVERAGE($T$30:T50))/(IF(STDEV($T$30:T50)<0.01,0.01,STDEV($T$30:T50)))*SQRT(COUNT($T$30:T50))/(2*(COUNT($T$30:T50)-1))))))>1,1,(MAX(0,(0.5-(($AR$21-AVERAGE($T$30:T50))/(IF(STDEV($T$30:T50)<0.01,0.01,STDEV($T$30:T50)))*SQRT(COUNT($T$30:T50))/(2*(COUNT($T$30:T50)-1)))))))","v":{"$error":"#VALUE!"}},{"$f":"IF((MAX(0,(0.5-(($AS$21-AVERAGE($AA$30:AA50))/(IF(STDEV($AA$30:AA50)<0.01,0.01,STDEV($AA$30:AA50)))*SQRT(COUNT($AA$30:AA50))/(2*(COUNT($AA$30:AA50)-1))))))>1,1,(MAX(0,(0.5-(($AS$21-AVERAGE($AA$30:AA50))/(IF(STDEV($AA$30:AA50)<0.01,0.01,STDEV($AA$30:AA50)))*SQRT(COUNT($AA$30:AA50))/(2*(COUNT($AA$30:AA50)-1)))))))","v":{"$error":"#DIV/0!"}},{"$f":"IF((MAX(0,(0.5-(($AT$21-AVERAGE($AB$30:AB50))/(IF(STDEV($AB$30:AB50)<0.01,0.01,STDEV($AB$30:AB50)))*SQRT(COUNT($AB$30:AB50))/(2*(COUNT($AB$30:AB50)-1))))))>1,1,(MAX(0,(0.5-(($AT$21-AVERAGE($AB$30:AB50))/(IF(STDEV($AB$30:AB50)<0.01,0.01,STDEV($AB$30:AB50)))*SQRT(COUNT($AB$30:AB50))/(2*(COUNT($AB$30:AB50)-1)))))))","v":{"$error":"#VALUE!"}},null,{"$f":"IF((MAX(0,(0.5-((AVERAGE($M$30:M50)-$AV$22)/(IF(STDEV($M$30:M50)<0.01,0.01,STDEV($M$30:M50)))*SQRT(COUNT($M$30:M50))/(2*(COUNT($M$30:M50)-1))))))>1,1,(MAX(0,(0.5-((AVERAGE($M$30:M50)-$AV$22)/(IF(STDEV($M$30:M50)<0.01,0.01,STDEV($M$30:M50)))*SQRT(COUNT($M$30:M50))/(2*(COUNT($M$30:M50)-1)))))))","v":{"$error":"#DIV/0!"}},{"$f":"IF((MAX(0,(0.5-((AVERAGE($N$30:N50)-$AW$22)/(IF(STDEV($N$30:N50)<0.01,0.01,STDEV($N$30:N50)))*SQRT(COUNT($N$30:N50))/(2*(COUNT($N$30:N50)-1))))))>1,1,(MAX(0,(0.5-((AVERAGE($N$30:N50)-$AW$22)/(IF(STDEV($N$30:N50)<0.01,0.01,STDEV($N$30:N50)))*SQRT(COUNT($N$30:N50))/(2*(COUNT($N$30:N50)-1)))))))","v":{"$error":"#DIV/0!"}},{"$f":"IF((MAX(0,(0.5-((AVERAGE($S$30:S50)-$AX$22)/(IF(STDEV($S$30:S50)<0.01,0.01,STDEV($S$30:S50)))*SQRT(COUNT($S$30:S50))/(2*(COUNT($S$30:S50)-1))))))>1,1,(MAX(0,(0.5-((AVERAGE($S$30:S50)-$AX$22)/(IF(STDEV($S$30:S50)<0.01,0.01,STDEV($S$30:S50)))*SQRT(COUNT($S$30:S50))/(2*(COUNT($S$30:S50)-1)))))))","v":{"$error":"#DIV/0!"}},{"$f":"IF((MAX(0,(0.5-((AVERAGE($T$30:T50)-$AY$22)/(IF(STDEV($T$30:T50)<0.01,0.01,STDEV($T$30:T50)))*SQRT(COUNT($T$30:T50))/(2*(COUNT($T$30:T50)-1))))))>1,1,(MAX(0,(0.5-((AVERAGE($T$30:T50)-$AY$22)/(IF(STDEV($T$30:T50)<0.01,0.01,STDEV($T$30:T50)))*SQRT(COUNT($T$30:T50))/(2*(COUNT($T$30:T50)-1)))))))","v":{"$error":"#DIV/0!"}},{"$f":"IF((MAX(0,(0.5-((AVERAGE($AA$30:AA50)-$AZ$22)/(IF(STDEV($AA$30:AA50)<0.01,0.01,STDEV($AA$30:AA50)))*SQRT(COUNT($AA$30:AA50))/(2*(COUNT($AA$30:AA50)-1))))))>1,1,(MAX(0,(0.5-((AVERAGE($AA$30:AA50)-$AZ$22)/(IF(STDEV($AA$30:AA50)<0.01,0.01,STDEV($AA$30:AA50)))*SQRT(COUNT($AA$30:AA50))/(2*(COUNT($AA$30:AA50)-1)))))))","v":{"$error":"#DIV/0!"}},{"$f":"IF((MAX(0,(0.5-((AVERAGE($AB$30:AB50)-$BA$22)/(IF(STDEV($AB$30:AB50)<0.01,0.01,STDEV($AB$30:AB50)))*SQRT(COUNT($AB$30:AB50))/(2*(COUNT($AB$30:AB50)-1))))))>1,1,(MAX(0,(0.5-((AVERAGE($AB$30:AB50)-$BA$22)/(IF(STDEV($AB$30:AB50)<0.01,0.01,STDEV($AB$30:AB50)))*SQRT(COUNT($AB$30:AB50))/(2*(COUNT($AB$30:AB50)-1)))))))","v":{"$error":"#DIV/0!"}},null,null,{"$f":"(0.5 * ((100-(BETADIST(AK50,((COUNT(M$30:M50))/2)-1,((COUNT(M$30:M50))/2)-1))*100) + (100-(BETADIST(AV50,((COUNT(M$30:M50))/2)-1,((COUNT(M$30:M50))/2)-1))*100) - 100) + 55) / 100","v":{"$error":"#VALUE!"}},{"$f":"(0.5 * ((100-(BETADIST(AL50,((COUNT(N$30:N50))/2)-1,((COUNT(N$30:N50))/2)-1))*100) + (100-(BETADIST(AW50,((COUNT(N$30:N50))/2)-1,((COUNT(N$30:N50))/2)-1))*100) - 100) + 55) / 100","v":{"$error":"#VALUE!"}},{"$f":"(0.5 * ((100-(BETADIST(AQ50,((COUNT(S$30:S50))/2)-1,((COUNT(S$30:S50))/2)-1))*100) + (100-(BETADIST(AX50,((COUNT(S$30:S50))/2)-1,((COUNT(S$30:S50))/2)-1))*100) - 100) + 55) / 100","v":{"$error":"#VALUE!"}},{"$f":"(0.5 * ((100-(BETADIST(AR50,((COUNT(T$30:T50))/2)-1,((COUNT(T$30:T50))/2)-1))*100) + (100-(BETADIST(AY50,((COUNT(T$30:T50))/2)-1,((COUNT(T$30:T50))/2)-1))*100) - 100) + 55) / 100","v":{"$error":"#VALUE!"}},{"$f":"(0.5 * ((100-(BETADIST(AS50,((COUNT(AA$30:AA50))/2)-1,((COUNT(AA$30:AA50))/2)-1))*100) + (100-(BETADIST(AZ50,((COUNT(AA$30:AA50))/2)-1,((COUNT(AA$30:AA50))/2)-1))*100) - 100) + 55) / 100","v":{"$error":"#DIV/0!"}},{"$f":"(0.5 * ((100-(BETADIST(AT50,((COUNT(AB$30:AB50))/2)-1,((COUNT(AB$30:AB50))/2)-1))*100) + (100-(BETADIST(BA50,((COUNT(AB$30:AB50))/2)-1,((COUNT(AB$30:AB50))/2)-1))*100) - 100) + 55) / 100","v":{"$error":"#VALUE!"}},{"$error":"#VALUE!"},null,null,null,null,null,null,null,null,null,null,null,null,null,null,null,null,null,null,null,null,null,null,null,null,null,null,null,null,null,null,null,null,null,null,null,null,null,null,null,null,null,null,null,null,null,1,21,null,null,null,null,null,null,null,null,41,null,10,null,null,7.3,5.32,92.3,92.8,94.2,2.2000000000000002,2.2999999999999998,2.4]
[null,null,null,null,null,null,null,null,null,null,null,null,null,null,null,null,null,null,null,null,null,null,null,null,null,null,"","",null,null,0,0,0,0,0,0,{"$f":"IF((MAX(0,(0.5-(($AK$21-AVERAGE($M$30:M51))/(IF(STDEV($M$30:M51)<0.01,0.01,STDEV($M$30:M51)))*SQRT(COUNT($M$30:M51))/(2*(COUNT($M$30:M51)-1))))))>1,1,(MAX(0,(0.5-(($AK$21-AVERAGE($M$30:M51))/(IF(STDEV($M$30:M51)<0.01,0.01,STDEV($M$30:M51)))*SQRT(COUNT($M$30:M51))/(2*(COUNT($M$30:M51)-1)))))))","v":{"$error":"#VALUE!"}},{"$f":"IF((MAX(0,(0.5-(($AL$21-AVERAGE($N$30:N51))/(IF(STDEV($N$30:N51)<0.01,0.01,STDEV($N$30:N51)))*SQRT(COUNT($N$30:N51))/(2*(COUNT($N$30:N51)-1))))))>1,1,(MAX(0,(0.5-(($AL$21-AVERAGE($N$30:N51))/(IF(STDEV($N$30:N51)<0.01,0.01,STDEV($N$30:N51)))*SQRT(COUNT($N$30:N51))/(2*(COUNT($N$30:N51)-1)))))))","v":{"$error":"#VALUE!"}},0,0,0,0,{"$f":"IF((MAX(0,(0.5-(($AQ$21-AVERAGE($S$30:S51))/(IF(STDEV($S$30:S51)<0.01,0.01,STDEV($S$30:S51)))*SQRT(COUNT($S$30:S51))/(2*(COUNT($S$30:S51)-1))))))>1,1,(MAX(0,(0.5-(($AQ$21-AVERAGE($S$30:S51))/(IF(STDEV($S$30:S51)<0.01,0.01,STDEV($S$30:S51)))*SQRT(COUNT($S$30:S51))/(2*(COUNT($S$30:S51)-1)))))))","v":{"$error":"#VALUE!"}},{"$f":"IF((MAX(0,(0.5-(($AR$21-AVERAGE($T$30:T51))/(IF(STDEV($T$30:T51)<0.01,0.01,STDEV($T$30:T51)))*SQRT(COUNT($T$30:T51))/(2*(COUNT($T$30:T51)-1))))))>1,1,(MAX(0,(0.5-(($AR$21-AVERAGE($T$30:T51))/(IF(STDEV($T$30:T51)<0.01,0.01,STDEV($T$30:T51)))*SQRT(COUNT($T$30:T51))/(2*(COUNT($T$30:T51)-1)))))))","v":{"$error":"#VALUE!"}},{"$f":"IF((MAX(0,(0.5-(($AS$21-AVERAGE($AA$30:AA51))/(IF(STDEV($AA$30:AA51)<0.01,0.01,STDEV($AA$30:AA51)))*SQRT(COUNT($AA$30:AA51))/(2*(COUNT($AA$30:AA51)-1))))))>1,1,(MAX(0,(0.5-(($AS$21-AVERAGE($AA$30:AA51))/(IF(STDEV($AA$30:AA51)<0.01,0.01,STDEV($AA$30:AA51)))*SQRT(COUNT($AA$30:AA51))/(2*(COUNT($AA$30:AA51)-1)))))))","v":{"$error":"#DIV/0!"}},{"$f":"IF((MAX(0,(0.5-(($AT$21-AVERAGE($AB$30:AB51))/(IF(STDEV($AB$30:AB51)<0.01,0.01,STDEV($AB$30:AB51)))*SQRT(COUNT($AB$30:AB51))/(2*(COUNT($AB$30:AB51)-1))))))>1,1,(MAX(0,(0.5-(($AT$21-AVERAGE($AB$30:AB51))/(IF(STDEV($AB$30:AB51)<0.01,0.01,STDEV($AB$30:AB51)))*SQRT(COUNT($AB$30:AB51))/(2*(COUNT($AB$30:AB51)-1)))))))","v":{"$error":"#VALUE!"}},null,{"$f":"IF((MAX(0,(0.5-((AVERAGE($M$30:M51)-$AV$22)/(IF(STDEV($M$30:M51)<0.01,0.01,STDEV($M$30:M51)))*SQRT(COUNT($M$30:M51))/(2*(COUNT($M$30:M51)-1))))))>1,1,(MAX(0,(0.5-((AVERAGE($M$30:M51)-$AV$22)/(IF(STDEV($M$30:M51)<0.01,0.01,STDEV($M$30:M51)))*SQRT(COUNT($M$30:M51))/(2*(COUNT($M$30:M51)-1)))))))","v":{"$error":"#DIV/0!"}},{"$f":"IF((MAX(0,(0.5-((AVERAGE($N$30:N51)-$AW$22)/(IF(STDEV($N$30:N51)<0.01,0.01,STDEV($N$30:N51)))*SQRT(COUNT($N$30:N51))/(2*(COUNT($N$30:N51)-1))))))>1,1,(MAX(0,(0.5-((AVERAGE($N$30:N51)-$AW$22)/(IF(STDEV($N$30:N51)<0.01,0.01,STDEV($N$30:N51)))*SQRT(COUNT($N$30:N51))/(2*(COUNT($N$30:N51)-1)))))))","v":{"$error":"#DIV/0!"}},{"$f":"IF((MAX(0,(0.5-((AVERAGE($S$30:S51)-$AX$22)/(IF(STDEV($S$30:S51)<0.01,0.01,STDEV($S$30:S51)))*SQRT(COUNT($S$30:S51))/(2*(COUNT($S$30:S51)-1))))))>1,1,(MAX(0,(0.5-((AVERAGE($S$30:S51)-$AX$22)/(IF(STDEV($S$30:S51)<0.01,0.01,STDEV($S$30:S51)))*SQRT(COUNT($S$30:S51))/(2*(COUNT($S$30:S51)-1)))))))","v":{"$error":"#DIV/0!"}},{"$f":"IF((MAX(0,(0.5-((AVERAGE($T$30:T51)-$AY$22)/(IF(STDEV($T$30:T51)<0.01,0.01,STDEV($T$30:T51)))*SQRT(COUNT($T$30:T51))/(2*(COUNT($T$30:T51)-1))))))>1,1,(MAX(0,(0.5-((AVERAGE($T$30:T51)-$AY$22)/(IF(STDEV($T$30:T51)<0.01,0.01,STDEV($T$30:T51)))*SQRT(COUNT($T$30:T51))/(2*(COUNT($T$30:T51)-1)))))))","v":{"$error":"#DIV/0!"}},{"$f":"IF((MAX(0,(0.5-((AVERAGE($AA$30:AA51)-$AZ$22)/(IF(STDEV($AA$30:AA51)<0.01,0.01,STDEV($AA$30:AA51)))*SQRT(COUNT($AA$30:AA51))/(2*(COUNT($AA$30:AA51)-1))))))>1,1,(MAX(0,(0.5-((AVERAGE($AA$30:AA51)-$AZ$22)/(IF(STDEV($AA$30:AA51)<0.01,0.01,STDEV($AA$30:AA51)))*SQRT(COUNT($AA$30:AA51))/(2*(COUNT($AA$30:AA51)-1)))))))","v":{"$error":"#DIV/0!"}},{"$f":"IF((MAX(0,(0.5-((AVERAGE($AB$30:AB51)-$BA$22)/(IF(STDEV($AB$30:AB51)<0.01,0.01,STDEV($AB$30:AB51)))*SQRT(COUNT($AB$30:AB51))/(2*(COUNT($AB$30:AB51)-1))))))>1,1,(MAX(0,(0.5-((AVERAGE($AB$30:AB51)-$BA$22)/(IF(STDEV($AB$30:AB51)<0.01,0.01,STDEV($AB$30:AB51)))*SQRT(COUNT($AB$30:AB51))/(2*(COUNT($AB$30:AB51)-1)))))))","v":{"$error":"#DIV/0!"}},null,null,{"$f":"(0.5 * ((100-(BETADIST(AK51,((COUNT(M$30:M51))/2)-1,((COUNT(M$30:M51))/2)-1))*100) + (100-(BETADIST(AV51,((COUNT(M$30:M51))/2)-1,((COUNT(M$30:M51))/2)-1))*100) - 100) + 55) / 100","v":{"$error":"#VALUE!"}},{"$f":"(0.5 * ((100-(BETADIST(AL51,((COUNT(N$30:N51))/2)-1,((COUNT(N$30:N51))/2)-1))*100) + (100-(BETADIST(AW51,((COUNT(N$30:N51))/2)-1,((COUNT(N$30:N51))/2)-1))*100) - 100) + 55) / 100","v":{"$error":"#VALUE!"}},{"$f":"(0.5 * ((100-(BETADIST(AQ51,((COUNT(S$30:S51))/2)-1,((COUNT(S$30:S51))/2)-1))*100) + (100-(BETADIST(AX51,((COUNT(S$30:S51))/2)-1,((COUNT(S$30:S51))/2)-1))*100) - 100) + 55) / 100","v":{"$error":"#VALUE!"}},{"$f":"(0.5 * ((100-(BETADIST(AR51,((COUNT(T$30:T51))/2)-1,((COUNT(T$30:T51))/2)-1))*100) + (100-(BETADIST(AY51,((COUNT(T$30:T51))/2)-1,((COUNT(T$30:T51))/2)-1))*100) - 100) + 55) / 100","v":{"$error":"#VALUE!"}},{"$f":"(0.5 * ((100-(BETADIST(AS51,((COUNT(AA$30:AA51))/2)-1,((COUNT(AA$30:AA51))/2)-1))*100) + (100-(BETADIST(AZ51,((COUNT(AA$30:AA51))/2)-1,((COUNT(AA$30:AA51))/2)-1))*100) - 100) + 55) / 100","v":{"$error":"#DIV/0!"}},{"$f":"(0.5 * ((100-(BETADIST(AT51,((COUNT(AB$30:AB51))/2)-1,((COUNT(AB$30:AB51))/2)-1))*100) + (100-(BETADIST(BA51,((COUNT(AB$30:AB51))/2)-1,((COUNT(AB$30:AB51))/2)-1))*100) - 100) + 55) / 100","v":{"$error":"#VALUE!"}},{"$error":"#VALUE!"},null,null,null,null,null,null,null,null,null,null,null,null,null,null,null,null,null,null,null,null,null,null,null,null,null,null,null,null,null,null,null,null,null,null,null,null,null,null,null,null,null,null,null,null,null,1,22,"NO",null,null,null,null,null,null,null,37,null,9,null,null,6.5,4.5999999999999996,93.3,92.1,95.1]
[null,null,null,null,null,null,null,null,null,null,null,null,null,null,null,null,null,null,null,null,null,null,null,null,null,null,"","",null,null,0,0,0,0,0,0,{"$f":"IF((MAX(0,(0.5-(($AK$21-AVERAGE($M$30:M52))/(IF(STDEV($M$30:M52)<0.01,0.01,STDEV($M$30:M52)))*SQRT(COUNT($M$30:M52))/(2*(COUNT($M$30:M52)-1))))))>1,1,(MAX(0,(0.5-(($AK$21-AVERAGE($M$30:M52))/(IF(STDEV($M$30:M52)<0.01,0.01,STDEV($M$30:M52)))*SQRT(COUNT($M$30:M52))/(2*(COUNT($M$30:M52)-1)))))))","v":{"$error":"#VALUE!"}},{"$f":"IF((MAX(0,(0.5-(($AL$21-AVERAGE($N$30:N52))/(IF(STDEV($N$30:N52)<0.01,0.01,STDEV($N$30:N52)))*SQRT(COUNT($N$30:N52))/(2*(COUNT($N$30:N52)-1))))))>1,1,(MAX(0,(0.5-(($AL$21-AVERAGE($N$30:N52))/(IF(STDEV($N$30:N52)<0.01,0.01,STDEV($N$30:N52)))*SQRT(COUNT($N$30:N52))/(2*(COUNT($N$30:N52)-1)))))))","v":{"$error":"#VALUE!"}},0,0,0,0,{"$f":"IF((MAX(0,(0.5-(($AQ$21-AVERAGE($S$30:S52))/(IF(STDEV($S$30:S52)<0.01,0.01,STDEV($S$30:S52)))*SQRT(COUNT($S$30:S52))/(2*(COUNT($S$30:S52)-1))))))>1,1,(MAX(0,(0.5-(($AQ$21-AVERAGE($S$30:S52))/(IF(STDEV($S$30:S52)<0.01,0.01,STDEV($S$30:S52)))*SQRT(COUNT($S$30:S52))/(2*(COUNT($S$30:S52)-1)))))))","v":{"$error":"#VALUE!"}},{"$f":"IF((MAX(0,(0.5-(($AR$21-AVERAGE($T$30:T52))/(IF(STDEV($T$30:T52)<0.01,0.01,STDEV($T$30:T52)))*SQRT(COUNT($T$30:T52))/(2*(COUNT($T$30:T52)-1))))))>1,1,(MAX(0,(0.5-(($AR$21-AVERAGE($T$30:T52))/(IF(STDEV($T$30:T52)<0.01,0.01,STDEV($T$30:T52)))*SQRT(COUNT($T$30:T52))/(2*(COUNT($T$30:T52)-1)))))))","v":{"$error":"#VALUE!"}},{"$f":"IF((MAX(0,(0.5-(($AS$21-AVERAGE($AA$30:AA52))/(IF(STDEV($AA$30:AA52)<0.01,0.01,STDEV($AA$30:AA52)))*SQRT(COUNT($AA$30:AA52))/(2*(COUNT($AA$30:AA52)-1))))))>1,1,(MAX(0,(0.5-(($AS$21-AVERAGE($AA$30:AA52))/(IF(STDEV($AA$30:AA52)<0.01,0.01,STDEV($AA$30:AA52)))*SQRT(COUNT($AA$30:AA52))/(2*(COUNT($AA$30:AA52)-1)))))))","v":{"$error":"#DIV/0!"}},{"$f":"IF((MAX(0,(0.5-(($AT$21-AVERAGE($AB$30:AB52))/(IF(STDEV($AB$30:AB52)<0.01,0.01,STDEV($AB$30:AB52)))*SQRT(COUNT($AB$30:AB52))/(2*(COUNT($AB$30:AB52)-1))))))>1,1,(MAX(0,(0.5-(($AT$21-AVERAGE($AB$30:AB52))/(IF(STDEV($AB$30:AB52)<0.01,0.01,STDEV($AB$30:AB52)))*SQRT(COUNT($AB$30:AB52))/(2*(COUNT($AB$30:AB52)-1)))))))","v":{"$error":"#VALUE!"}},null,{"$f":"IF((MAX(0,(0.5-((AVERAGE($M$30:M52)-$AV$22)/(IF(STDEV($M$30:M52)<0.01,0.01,STDEV($M$30:M52)))*SQRT(COUNT($M$30:M52))/(2*(COUNT($M$30:M52)-1))))))>1,1,(MAX(0,(0.5-((AVERAGE($M$30:M52)-$AV$22)/(IF(STDEV($M$30:M52)<0.01,0.01,STDEV($M$30:M52)))*SQRT(COUNT($M$30:M52))/(2*(COUNT($M$30:M52)-1)))))))","v":{"$error":"#DIV/0!"}},{"$f":"IF((MAX(0,(0.5-((AVERAGE($N$30:N52)-$AW$22)/(IF(STDEV($N$30:N52)<0.01,0.01,STDEV($N$30:N52)))*SQRT(COUNT($N$30:N52))/(2*(COUNT($N$30:N52)-1))))))>1,1,(MAX(0,(0.5-((AVERAGE($N$30:N52)-$AW$22)/(IF(STDEV($N$30:N52)<0.01,0.01,STDEV($N$30:N52)))*SQRT(COUNT($N$30:N52))/(2*(COUNT($N$30:N52)-1)))))))","v":{"$error":"#DIV/0!"}},{"$f":"IF((MAX(0,(0.5-((AVERAGE($S$30:S52)-$AX$22)/(IF(STDEV($S$30:S52)<0.01,0.01,STDEV($S$30:S52)))*SQRT(COUNT($S$30:S52))/(2*(COUNT($S$30:S52)-1))))))>1,1,(MAX(0,(0.5-((AVERAGE($S$30:S52)-$AX$22)/(IF(STDEV($S$30:S52)<0.01,0.01,STDEV($S$30:S52)))*SQRT(COUNT($S$30:S52))/(2*(COUNT($S$30:S52)-1)))))))","v":{"$error":"#DIV/0!"}},{"$f":"IF((MAX(0,(0.5-((AVERAGE($T$30:T52)-$AY$22)/(IF(STDEV($T$30:T52)<0.01,0.01,STDEV($T$30:T52)))*SQRT(COUNT($T$30:T52))/(2*(COUNT($T$30:T52)-1))))))>1,1,(MAX(0,(0.5-((AVERAGE($T$30:T52)-$AY$22)/(IF(STDEV($T$30:T52)<0.01,0.01,STDEV($T$30:T52)))*SQRT(COUNT($T$30:T52))/(2*(COUNT($T$30:T52)-1)))))))","v":{"$error":"#DIV/0!"}},{"$f":"IF((MAX(0,(0.5-((AVERAGE($AA$30:AA52)-$AZ$22)/(IF(STDEV($AA$30:AA52)<0.01,0.01,STDEV($AA$30:AA52)))*SQRT(COUNT($AA$30:AA52))/(2*(COUNT($AA$30:AA52)-1))))))>1,1,(MAX(0,(0.5-((AVERAGE($AA$30:AA52)-$AZ$22)/(IF(STDEV($AA$30:AA52)<0.01,0.01,STDEV($AA$30:AA52)))*SQRT(COUNT($AA$30:AA52))/(2*(COUNT($AA$30:AA52)-1)))))))","v":{"$error":"#DIV/0!"}},{"$f":"IF((MAX(0,(0.5-((AVERAGE($AB$30:AB52)-$BA$22)/(IF(STDEV($AB$30:AB52)<0.01,0.01,STDEV($AB$30:AB52)))*SQRT(COUNT($AB$30:AB52))/(2*(COUNT($AB$30:AB52)-1))))))>1,1,(MAX(0,(0.5-((AVERAGE($AB$30:AB52)-$BA$22)/(IF(STDEV($AB$30:AB52)<0.01,0.01,STDEV($AB$30:AB52)))*SQRT(COUNT($AB$30:AB52))/(2*(COUNT($AB$30:AB52)-1)))))))","v":{"$error":"#DIV/0!"}},null,null,{"$f":"(0.5 * ((100-(BETADIST(AK52,((COUNT(M$30:M52))/2)-1,((COUNT(M$30:M52))/2)-1))*100) + (100-(BETADIST(AV52,((COUNT(M$30:M52))/2)-1,((COUNT(M$30:M52))/2)-1))*100) - 100) + 55) / 100","v":{"$error":"#VALUE!"}},{"$f":"(0.5 * ((100-(BETADIST(AL52,((COUNT(N$30:N52))/2)-1,((COUNT(N$30:N52))/2)-1))*100) + (100-(BETADIST(AW52,((COUNT(N$30:N52))/2)-1,((COUNT(N$30:N52))/2)-1))*100) - 100) + 55) / 100","v":{"$error":"#VALUE!"}},{"$f":"(0.5 * ((100-(BETADIST(AQ52,((COUNT(S$30:S52))/2)-1,((COUNT(S$30:S52))/2)-1))*100) + (100-(BETADIST(AX52,((COUNT(S$30:S52))/2)-1,((COUNT(S$30:S52))/2)-1))*100) - 100) + 55) / 100","v":{"$error":"#VALUE!"}},{"$f":"(0.5 * ((100-(BETADIST(AR52,((COUNT(T$30:T52))/2)-1,((COUNT(T$30:T52))/2)-1))*100) + (100-(BETADIST(AY52,((COUNT(T$30:T52))/2)-1,((COUNT(T$30:T52))/2)-1))*100) - 100) + 55) / 100","v":{"$error":"#VALUE!"}},{"$f":"(0.5 * ((100-(BETADIST(AS52,((COUNT(AA$30:AA52))/2)-1,((COUNT(AA$30:AA52))/2)-1))*100) + (100-(BETADIST(AZ52,((COUNT(AA$30:AA52))/2)-1,((COUNT(AA$30:AA52))/2)-1))*100) - 100) + 55) / 100","v":{"$error":"#DIV/0!"}},{"$f":"(0.5 * ((100-(BETADIST(AT52,((COUNT(AB$30:AB52))/2)-1,((COUNT(AB$30:AB52))/2)-1))*100) + (100-(BETADIST(BA52,((COUNT(AB$30:AB52))/2)-1,((COUNT(AB$30:AB52))/2)-1))*100) - 100) + 55) / 100","v":{"$error":"#VALUE!"}},{"$error":"#VALUE!"},null,null,null,null,null,null,null,null,null,null,null,null,null,null,null,null,null,null,null,null,null,null,null,null,null,null,null,null,null,null,null,null,null,null,null,null,null,null,null,null,null,null,null,"2009-09-18",null,1,23,null,null,null,null,null,null,null,null,35,null,8,null,null,6.2,4.72,93.5,92.3,92.7,2,2.1,2.2000000000000002]
[null,null,null,null,null,null,null,null,null,null,null,null,null,null,null,null,null,null,null,null,null,null,null,null,null,null,"","",null,null,0,0,0,0,0,0,{"$f":"IF((MAX(0,(0.5-(($AK$21-AVERAGE($M$30:M53))/(IF(STDEV($M$30:M53)<0.01,0.01,STDEV($M$30:M53)))*SQRT(COUNT($M$30:M53))/(2*(COUNT($M$30:M53)-1))))))>1,1,(MAX(0,(0.5-(($AK$21-AVERAGE($M$30:M53))/(IF(STDEV($M$30:M53)<0.01,0.01,STDEV($M$30:M53)))*SQRT(COUNT($M$30:M53))/(2*(COUNT($M$30:M53)-1)))))))","v":{"$error":"#VALUE!"}},{"$f":"IF((MAX(0,(0.5-(($AL$21-AVERAGE($N$30:N53))/(IF(STDEV($N$30:N53)<0.01,0.01,STDEV($N$30:N53)))*SQRT(COUNT($N$30:N53))/(2*(COUNT($N$30:N53)-1))))))>1,1,(MAX(0,(0.5-(($AL$21-AVERAGE($N$30:N53))/(IF(STDEV($N$30:N53)<0.01,0.01,STDEV($N$30:N53)))*SQRT(COUNT($N$30:N53))/(2*(COUNT($N$30:N53)-1)))))))","v":{"$error":"#VALUE!"}},0,0,0,0,{"$f":"IF((MAX(0,(0.5-(($AQ$21-AVERAGE($S$30:S53))/(IF(STDEV($S$30:S53)<0.01,0.01,STDEV($S$30:S53)))*SQRT(COUNT($S$30:S53))/(2*(COUNT($S$30:S53)-1))))))>1,1,(MAX(0,(0.5-(($AQ$21-AVERAGE($S$30:S53))/(IF(STDEV($S$30:S53)<0.01,0.01,STDEV($S$30:S53)))*SQRT(COUNT($S$30:S53))/(2*(COUNT($S$30:S53)-1)))))))","v":{"$error":"#VALUE!"}},{"$f":"IF((MAX(0,(0.5-(($AR$21-AVERAGE($T$30:T53))/(IF(STDEV($T$30:T53)<0.01,0.01,STDEV($T$30:T53)))*SQRT(COUNT($T$30:T53))/(2*(COUNT($T$30:T53)-1))))))>1,1,(MAX(0,(0.5-(($AR$21-AVERAGE($T$30:T53))/(IF(STDEV($T$30:T53)<0.01,0.01,STDEV($T$30:T53)))*SQRT(COUNT($T$30:T53))/(2*(COUNT($T$30:T53)-1)))))))","v":{"$error":"#VALUE!"}},{"$f":"IF((MAX(0,(0.5-(($AS$21-AVERAGE($AA$30:AA53))/(IF(STDEV($AA$30:AA53)<0.01,0.01,STDEV($AA$30:AA53)))*SQRT(COUNT($AA$30:AA53))/(2*(COUNT($AA$30:AA53)-1))))))>1,1,(MAX(0,(0.5-(($AS$21-AVERAGE($AA$30:AA53))/(IF(STDEV($AA$30:AA53)<0.01,0.01,STDEV($AA$30:AA53)))*SQRT(COUNT($AA$30:AA53))/(2*(COUNT($AA$30:AA53)-1)))))))","v":{"$error":"#DIV/0!"}},{"$f":"IF((MAX(0,(0.5-(($AT$21-AVERAGE($AB$30:AB53))/(IF(STDEV($AB$30:AB53)<0.01,0.01,STDEV($AB$30:AB53)))*SQRT(COUNT($AB$30:AB53))/(2*(COUNT($AB$30:AB53)-1))))))>1,1,(MAX(0,(0.5-(($AT$21-AVERAGE($AB$30:AB53))/(IF(STDEV($AB$30:AB53)<0.01,0.01,STDEV($AB$30:AB53)))*SQRT(COUNT($AB$30:AB53))/(2*(COUNT($AB$30:AB53)-1)))))))","v":{"$error":"#VALUE!"}},null,{"$f":"IF((MAX(0,(0.5-((AVERAGE($M$30:M53)-$AV$22)/(IF(STDEV($M$30:M53)<0.01,0.01,STDEV($M$30:M53)))*SQRT(COUNT($M$30:M53))/(2*(COUNT($M$30:M53)-1))))))>1,1,(MAX(0,(0.5-((AVERAGE($M$30:M53)-$AV$22)/(IF(STDEV($M$30:M53)<0.01,0.01,STDEV($M$30:M53)))*SQRT(COUNT($M$30:M53))/(2*(COUNT($M$30:M53)-1)))))))","v":{"$error":"#DIV/0!"}},{"$f":"IF((MAX(0,(0.5-((AVERAGE($N$30:N53)-$AW$22)/(IF(STDEV($N$30:N53)<0.01,0.01,STDEV($N$30:N53)))*SQRT(COUNT($N$30:N53))/(2*(COUNT($N$30:N53)-1))))))>1,1,(MAX(0,(0.5-((AVERAGE($N$30:N53)-$AW$22)/(IF(STDEV($N$30:N53)<0.01,0.01,STDEV($N$30:N53)))*SQRT(COUNT($N$30:N53))/(2*(COUNT($N$30:N53)-1)))))))","v":{"$error":"#DIV/0!"}},{"$f":"IF((MAX(0,(0.5-((AVERAGE($S$30:S53)-$AX$22)/(IF(STDEV($S$30:S53)<0.01,0.01,STDEV($S$30:S53)))*SQRT(COUNT($S$30:S53))/(2*(COUNT($S$30:S53)-1))))))>1,1,(MAX(0,(0.5-((AVERAGE($S$30:S53)-$AX$22)/(IF(STDEV($S$30:S53)<0.01,0.01,STDEV($S$30:S53)))*SQRT(COUNT($S$30:S53))/(2*(COUNT($S$30:S53)-1)))))))","v":{"$error":"#DIV/0!"}},{"$f":"IF((MAX(0,(0.5-((AVERAGE($T$30:T53)-$AY$22)/(IF(STDEV($T$30:T53)<0.01,0.01,STDEV($T$30:T53)))*SQRT(COUNT($T$30:T53))/(2*(COUNT($T$30:T53)-1))))))>1,1,(MAX(0,(0.5-((AVERAGE($T$30:T53)-$AY$22)/(IF(STDEV($T$30:T53)<0.01,0.01,STDEV($T$30:T53)))*SQRT(COUNT($T$30:T53))/(2*(COUNT($T$30:T53)-1)))))))","v":{"$error":"#DIV/0!"}},{"$f":"IF((MAX(0,(0.5-((AVERAGE($AA$30:AA53)-$AZ$22)/(IF(STDEV($AA$30:AA53)<0.01,0.01,STDEV($AA$30:AA53)))*SQRT(COUNT($AA$30:AA53))/(2*(COUNT($AA$30:AA53)-1))))))>1,1,(MAX(0,(0.5-((AVERAGE($AA$30:AA53)-$AZ$22)/(IF(STDEV($AA$30:AA53)<0.01,0.01,STDEV($AA$30:AA53)))*SQRT(COUNT($AA$30:AA53))/(2*(COUNT($AA$30:AA53)-1)))))))","v":{"$error":"#DIV/0!"}},{"$f":"IF((MAX(0,(0.5-((AVERAGE($AB$30:AB53)-$BA$22)/(IF(STDEV($AB$30:AB53)<0.01,0.01,STDEV($AB$30:AB53)))*SQRT(COUNT($AB$30:AB53))/(2*(COUNT($AB$30:AB53)-1))))))>1,1,(MAX(0,(0.5-((AVERAGE($AB$30:AB53)-$BA$22)/(IF(STDEV($AB$30:AB53)<0.01,0.01,STDEV($AB$30:AB53)))*SQRT(COUNT($AB$30:AB53))/(2*(COUNT($AB$30:AB53)-1)))))))","v":{"$error":"#DIV/0!"}},null,null,{"$f":"(0.5 * ((100-(BETADIST(AK53,((COUNT(M$30:M53))/2)-1,((COUNT(M$30:M53))/2)-1))*100) + (100-(BETADIST(AV53,((COUNT(M$30:M53))/2)-1,((COUNT(M$30:M53))/2)-1))*100) - 100) + 55) / 100","v":{"$error":"#VALUE!"}},{"$f":"(0.5 * ((100-(BETADIST(AL53,((COUNT(N$30:N53))/2)-1,((COUNT(N$30:N53))/2)-1))*100) + (100-(BETADIST(AW53,((COUNT(N$30:N53))/2)-1,((COUNT(N$30:N53))/2)-1))*100) - 100) + 55) / 100","v":{"$error":"#VALUE!"}},{"$f":"(0.5 * ((100-(BETADIST(AQ53,((COUNT(S$30:S53))/2)-1,((COUNT(S$30:S53))/2)-1))*100) + (100-(BETADIST(AX53,((COUNT(S$30:S53))/2)-1,((COUNT(S$30:S53))/2)-1))*100) - 100) + 55) / 100","v":{"$error":"#VALUE!"}},{"$f":"(0.5 * ((100-(BETADIST(AR53,((COUNT(T$30:T53))/2)-1,((COUNT(T$30:T53))/2)-1))*100) + (100-(BETADIST(AY53,((COUNT(T$30:T53))/2)-1,((COUNT(T$30:T53))/2)-1))*100) - 100) + 55) / 100","v":{"$error":"#VALUE!"}},{"$f":"(0.5 * ((100-(BETADIST(AS53,((COUNT(AA$30:AA53))/2)-1,((COUNT(AA$30:AA53))/2)-1))*100) + (100-(BETADIST(AZ53,((COUNT(AA$30:AA53))/2)-1,((COUNT(AA$30:AA53))/2)-1))*100) - 100) + 55) / 100","v":{"$error":"#DIV/0!"}},{"$f":"(0.5 * ((100-(BETADIST(AT53,((COUNT(AB$30:AB53))/2)-1,((COUNT(AB$30:AB53))/2)-1))*100) + (100-(BETADIST(BA53,((COUNT(AB$30:AB53))/2)-1,((COUNT(AB$30:AB53))/2)-1))*100) - 100) + 55) / 100","v":{"$error":"#VALUE!"}},{"$error":"#VALUE!"},null,null,null,null,null,null,null,null,null,null,null,null,null,null,null,null,null,null,null,null,null,null,null,null,null,null,null,null,null,null,null,null,null,null,null,null,null,null,null,null,null,null,null,"2009-09-18",null,1,24,null,null,null,null,null,null,null,null,37,null,9,null,null,6.6,5.01,91.1,91.1,91.1]
[null,null,null,null,null,null,null,null,null,null,null,null,null,null,null,null,null,null,null,null,null,null,null,null,null,null,"","",null,null,0,0,0,0,0,0,{"$f":"IF((MAX(0,(0.5-(($AK$21-AVERAGE($M$30:M54))/(IF(STDEV($M$30:M54)<0.01,0.01,STDEV($M$30:M54)))*SQRT(COUNT($M$30:M54))/(2*(COUNT($M$30:M54)-1))))))>1,1,(MAX(0,(0.5-(($AK$21-AVERAGE($M$30:M54))/(IF(STDEV($M$30:M54)<0.01,0.01,STDEV($M$30:M54)))*SQRT(COUNT($M$30:M54))/(2*(COUNT($M$30:M54)-1)))))))","v":{"$error":"#VALUE!"}},{"$f":"IF((MAX(0,(0.5-(($AL$21-AVERAGE($N$30:N54))/(IF(STDEV($N$30:N54)<0.01,0.01,STDEV($N$30:N54)))*SQRT(COUNT($N$30:N54))/(2*(COUNT($N$30:N54)-1))))))>1,1,(MAX(0,(0.5-(($AL$21-AVERAGE($N$30:N54))/(IF(STDEV($N$30:N54)<0.01,0.01,STDEV($N$30:N54)))*SQRT(COUNT($N$30:N54))/(2*(COUNT($N$30:N54)-1)))))))","v":{"$error":"#VALUE!"}},0,0,0,0,{"$f":"IF((MAX(0,(0.5-(($AQ$21-AVERAGE($S$30:S54))/(IF(STDEV($S$30:S54)<0.01,0.01,STDEV($S$30:S54)))*SQRT(COUNT($S$30:S54))/(2*(COUNT($S$30:S54)-1))))))>1,1,(MAX(0,(0.5-(($AQ$21-AVERAGE($S$30:S54))/(IF(STDEV($S$30:S54)<0.01,0.01,STDEV($S$30:S54)))*SQRT(COUNT($S$30:S54))/(2*(COUNT($S$30:S54)-1)))))))","v":{"$error":"#VALUE!"}},{"$f":"IF((MAX(0,(0.5-(($AR$21-AVERAGE($T$30:T54))/(IF(STDEV($T$30:T54)<0.01,0.01,STDEV($T$30:T54)))*SQRT(COUNT($T$30:T54))/(2*(COUNT($T$30:T54)-1))))))>1,1,(MAX(0,(0.5-(($AR$21-AVERAGE($T$30:T54))/(IF(STDEV($T$30:T54)<0.01,0.01,STDEV($T$30:T54)))*SQRT(COUNT($T$30:T54))/(2*(COUNT($T$30:T54)-1)))))))","v":{"$error":"#VALUE!"}},{"$f":"IF((MAX(0,(0.5-(($AS$21-AVERAGE($AA$30:AA54))/(IF(STDEV($AA$30:AA54)<0.01,0.01,STDEV($AA$30:AA54)))*SQRT(COUNT($AA$30:AA54))/(2*(COUNT($AA$30:AA54)-1))))))>1,1,(MAX(0,(0.5-(($AS$21-AVERAGE($AA$30:AA54))/(IF(STDEV($AA$30:AA54)<0.01,0.01,STDEV($AA$30:AA54)))*SQRT(COUNT($AA$30:AA54))/(2*(COUNT($AA$30:AA54)-1)))))))","v":{"$error":"#DIV/0!"}},{"$f":"IF((MAX(0,(0.5-(($AT$21-AVERAGE($AB$30:AB54))/(IF(STDEV($AB$30:AB54)<0.01,0.01,STDEV($AB$30:AB54)))*SQRT(COUNT($AB$30:AB54))/(2*(COUNT($AB$30:AB54)-1))))))>1,1,(MAX(0,(0.5-(($AT$21-AVERAGE($AB$30:AB54))/(IF(STDEV($AB$30:AB54)<0.01,0.01,STDEV($AB$30:AB54)))*SQRT(COUNT($AB$30:AB54))/(2*(COUNT($AB$30:AB54)-1)))))))","v":{"$error":"#VALUE!"}},null,{"$f":"IF((MAX(0,(0.5-((AVERAGE($M$30:M54)-$AV$22)/(IF(STDEV($M$30:M54)<0.01,0.01,STDEV($M$30:M54)))*SQRT(COUNT($M$30:M54))/(2*(COUNT($M$30:M54)-1))))))>1,1,(MAX(0,(0.5-((AVERAGE($M$30:M54)-$AV$22)/(IF(STDEV($M$30:M54)<0.01,0.01,STDEV($M$30:M54)))*SQRT(COUNT($M$30:M54))/(2*(COUNT($M$30:M54)-1)))))))","v":{"$error":"#DIV/0!"}},{"$f":"IF((MAX(0,(0.5-((AVERAGE($N$30:N54)-$AW$22)/(IF(STDEV($N$30:N54)<0.01,0.01,STDEV($N$30:N54)))*SQRT(COUNT($N$30:N54))/(2*(COUNT($N$30:N54)-1))))))>1,1,(MAX(0,(0.5-((AVERAGE($N$30:N54)-$AW$22)/(IF(STDEV($N$30:N54)<0.01,0.01,STDEV($N$30:N54)))*SQRT(COUNT($N$30:N54))/(2*(COUNT($N$30:N54)-1)))))))","v":{"$error":"#DIV/0!"}},{"$f":"IF((MAX(0,(0.5-((AVERAGE($S$30:S54)-$AX$22)/(IF(STDEV($S$30:S54)<0.01,0.01,STDEV($S$30:S54)))*SQRT(COUNT($S$30:S54))/(2*(COUNT($S$30:S54)-1))))))>1,1,(MAX(0,(0.5-((AVERAGE($S$30:S54)-$AX$22)/(IF(STDEV($S$30:S54)<0.01,0.01,STDEV($S$30:S54)))*SQRT(COUNT($S$30:S54))/(2*(COUNT($S$30:S54)-1)))))))","v":{"$error":"#DIV/0!"}},{"$f":"IF((MAX(0,(0.5-((AVERAGE($T$30:T54)-$AY$22)/(IF(STDEV($T$30:T54)<0.01,0.01,STDEV($T$30:T54)))*SQRT(COUNT($T$30:T54))/(2*(COUNT($T$30:T54)-1))))))>1,1,(MAX(0,(0.5-((AVERAGE($T$30:T54)-$AY$22)/(IF(STDEV($T$30:T54)<0.01,0.01,STDEV($T$30:T54)))*SQRT(COUNT($T$30:T54))/(2*(COUNT($T$30:T54)-1)))))))","v":{"$error":"#DIV/0!"}},{"$f":"IF((MAX(0,(0.5-((AVERAGE($AA$30:AA54)-$AZ$22)/(IF(STDEV($AA$30:AA54)<0.01,0.01,STDEV($AA$30:AA54)))*SQRT(COUNT($AA$30:AA54))/(2*(COUNT($AA$30:AA54)-1))))))>1,1,(MAX(0,(0.5-((AVERAGE($AA$30:AA54)-$AZ$22)/(IF(STDEV($AA$30:AA54)<0.01,0.01,STDEV($AA$30:AA54)))*SQRT(COUNT($AA$30:AA54))/(2*(COUNT($AA$30:AA54)-1)))))))","v":{"$error":"#DIV/0!"}},{"$f":"IF((MAX(0,(0.5-((AVERAGE($AB$30:AB54)-$BA$22)/(IF(STDEV($AB$30:AB54)<0.01,0.01,STDEV($AB$30:AB54)))*SQRT(COUNT($AB$30:AB54))/(2*(COUNT($AB$30:AB54)-1))))))>1,1,(MAX(0,(0.5-((AVERAGE($AB$30:AB54)-$BA$22)/(IF(STDEV($AB$30:AB54)<0.01,0.01,STDEV($AB$30:AB54)))*SQRT(COUNT($AB$30:AB54))/(2*(COUNT($AB$30:AB54)-1)))))))","v":{"$error":"#DIV/0!"}},null,null,{"$f":"(0.5 * ((100-(BETADIST(AK54,((COUNT(M$30:M54))/2)-1,((COUNT(M$30:M54))/2)-1))*100) + (100-(BETADIST(AV54,((COUNT(M$30:M54))/2)-1,((COUNT(M$30:M54))/2)-1))*100) - 100) + 55) / 100","v":{"$error":"#VALUE!"}},{"$f":"(0.5 * ((100-(BETADIST(AL54,((COUNT(N$30:N54))/2)-1,((COUNT(N$30:N54))/2)-1))*100) + (100-(BETADIST(AW54,((COUNT(N$30:N54))/2)-1,((COUNT(N$30:N54))/2)-1))*100) - 100) + 55) / 100","v":{"$error":"#VALUE!"}},{"$f":"(0.5 * ((100-(BETADIST(AQ54,((COUNT(S$30:S54))/2)-1,((COUNT(S$30:S54))/2)-1))*100) + (100-(BETADIST(AX54,((COUNT(S$30:S54))/2)-1,((COUNT(S$30:S54))/2)-1))*100) - 100) + 55) / 100","v":{"$error":"#VALUE!"}},{"$f":"(0.5 * ((100-(BETADIST(AR54,((COUNT(T$30:T54))/2)-1,((COUNT(T$30:T54))/2)-1))*100) + (100-(BETADIST(AY54,((COUNT(T$30:T54))/2)-1,((COUNT(T$30:T54))/2)-1))*100) - 100) + 55) / 100","v":{"$error":"#VALUE!"}},{"$f":"(0.5 * ((100-(BETADIST(AS54,((COUNT(AA$30:AA54))/2)-1,((COUNT(AA$30:AA54))/2)-1))*100) + (100-(BETADIST(AZ54,((COUNT(AA$30:AA54))/2)-1,((COUNT(AA$30:AA54))/2)-1))*100) - 100) + 55) / 100","v":{"$error":"#DIV/0!"}},{"$f":"(0.5 * ((100-(BETADIST(AT54,((COUNT(AB$30:AB54))/2)-1,((COUNT(AB$30:AB54))/2)-1))*100) + (100-(BETADIST(BA54,((COUNT(AB$30:AB54))/2)-1,((COUNT(AB$30:AB54))/2)-1))*100) - 100) + 55) / 100","v":{"$error":"#VALUE!"}},{"$error":"#VALUE!"},null,null,null,null,null,null,null,null,null,null,null,null,null,null,null,null,null,null,null,null,null,null,null,null,null,null,null,null,null,null,null,null,null,null,null,null,null,null,null,null,null,null,null,"2009-09-18",null,1,25,null,null,null,null,null,null,null,null,33,null,10,null,null,5.9,5.19,92.2,91.5,93.4,1,1.1000000000000001,1.2]
[null,null,null,null,null,null,null,null,null,null,null,null,null,null,null,null,null,null,null,null,null,null,null,null,null,null,"","",null,null,0,0,0,0,0,0,{"$f":"IF((MAX(0,(0.5-(($AK$21-AVERAGE($M$30:M55))/(IF(STDEV($M$30:M55)<0.01,0.01,STDEV($M$30:M55)))*SQRT(COUNT($M$30:M55))/(2*(COUNT($M$30:M55)-1))))))>1,1,(MAX(0,(0.5-(($AK$21-AVERAGE($M$30:M55))/(IF(STDEV($M$30:M55)<0.01,0.01,STDEV($M$30:M55)))*SQRT(COUNT($M$30:M55))/(2*(COUNT($M$30:M55)-1)))))))","v":{"$error":"#VALUE!"}},{"$f":"IF((MAX(0,(0.5-(($AL$21-AVERAGE($N$30:N55))/(IF(STDEV($N$30:N55)<0.01,0.01,STDEV($N$30:N55)))*SQRT(COUNT($N$30:N55))/(2*(COUNT($N$30:N55)-1))))))>1,1,(MAX(0,(0.5-(($AL$21-AVERAGE($N$30:N55))/(IF(STDEV($N$30:N55)<0.01,0.01,STDEV($N$30:N55)))*SQRT(COUNT($N$30:N55))/(2*(COUNT($N$30:N55)-1)))))))","v":{"$error":"#VALUE!"}},0,0,0,0,{"$f":"IF((MAX(0,(0.5-(($AQ$21-AVERAGE($S$30:S55))/(IF(STDEV($S$30:S55)<0.01,0.01,STDEV($S$30:S55)))*SQRT(COUNT($S$30:S55))/(2*(COUNT($S$30:S55)-1))))))>1,1,(MAX(0,(0.5-(($AQ$21-AVERAGE($S$30:S55))/(IF(STDEV($S$30:S55)<0.01,0.01,STDEV($S$30:S55)))*SQRT(COUNT($S$30:S55))/(2*(COUNT($S$30:S55)-1)))))))","v":{"$error":"#VALUE!"}},{"$f":"IF((MAX(0,(0.5-(($AR$21-AVERAGE($T$30:T55))/(IF(STDEV($T$30:T55)<0.01,0.01,STDEV($T$30:T55)))*SQRT(COUNT($T$30:T55))/(2*(COUNT($T$30:T55)-1))))))>1,1,(MAX(0,(0.5-(($AR$21-AVERAGE($T$30:T55))/(IF(STDEV($T$30:T55)<0.01,0.01,STDEV($T$30:T55)))*SQRT(COUNT($T$30:T55))/(2*(COUNT($T$30:T55)-1)))))))","v":{"$error":"#VALUE!"}},{"$f":"IF((MAX(0,(0.5-(($AS$21-AVERAGE($AA$30:AA55))/(IF(STDEV($AA$30:AA55)<0.01,0.01,STDEV($AA$30:AA55)))*SQRT(COUNT($AA$30:AA55))/(2*(COUNT($AA$30:AA55)-1))))))>1,1,(MAX(0,(0.5-(($AS$21-AVERAGE($AA$30:AA55))/(IF(STDEV($AA$30:AA55)<0.01,0.01,STDEV($AA$30:AA55)))*SQRT(COUNT($AA$30:AA55))/(2*(COUNT($AA$30:AA55)-1)))))))","v":{"$error":"#DIV/0!"}},{"$f":"IF((MAX(0,(0.5-(($AT$21-AVERAGE($AB$30:AB55))/(IF(STDEV($AB$30:AB55)<0.01,0.01,STDEV($AB$30:AB55)))*SQRT(COUNT($AB$30:AB55))/(2*(COUNT($AB$30:AB55)-1))))))>1,1,(MAX(0,(0.5-(($AT$21-AVERAGE($AB$30:AB55))/(IF(STDEV($AB$30:AB55)<0.01,0.01,STDEV($AB$30:AB55)))*SQRT(COUNT($AB$30:AB55))/(2*(COUNT($AB$30:AB55)-1)))))))","v":{"$error":"#VALUE!"}},null,{"$f":"IF((MAX(0,(0.5-((AVERAGE($M$30:M55)-$AV$22)/(IF(STDEV($M$30:M55)<0.01,0.01,STDEV($M$30:M55)))*SQRT(COUNT($M$30:M55))/(2*(COUNT($M$30:M55)-1))))))>1,1,(MAX(0,(0.5-((AVERAGE($M$30:M55)-$AV$22)/(IF(STDEV($M$30:M55)<0.01,0.01,STDEV($M$30:M55)))*SQRT(COUNT($M$30:M55))/(2*(COUNT($M$30:M55)-1)))))))","v":{"$error":"#DIV/0!"}},{"$f":"IF((MAX(0,(0.5-((AVERAGE($N$30:N55)-$AW$22)/(IF(STDEV($N$30:N55)<0.01,0.01,STDEV($N$30:N55)))*SQRT(COUNT($N$30:N55))/(2*(COUNT($N$30:N55)-1))))))>1,1,(MAX(0,(0.5-((AVERAGE($N$30:N55)-$AW$22)/(IF(STDEV($N$30:N55)<0.01,0.01,STDEV($N$30:N55)))*SQRT(COUNT($N$30:N55))/(2*(COUNT($N$30:N55)-1)))))))","v":{"$error":"#DIV/0!"}},{"$f":"IF((MAX(0,(0.5-((AVERAGE($S$30:S55)-$AX$22)/(IF(STDEV($S$30:S55)<0.01,0.01,STDEV($S$30:S55)))*SQRT(COUNT($S$30:S55))/(2*(COUNT($S$30:S55)-1))))))>1,1,(MAX(0,(0.5-((AVERAGE($S$30:S55)-$AX$22)/(IF(STDEV($S$30:S55)<0.01,0.01,STDEV($S$30:S55)))*SQRT(COUNT($S$30:S55))/(2*(COUNT($S$30:S55)-1)))))))","v":{"$error":"#DIV/0!"}},{"$f":"IF((MAX(0,(0.5-((AVERAGE($T$30:T55)-$AY$22)/(IF(STDEV($T$30:T55)<0.01,0.01,STDEV($T$30:T55)))*SQRT(COUNT($T$30:T55))/(2*(COUNT($T$30:T55)-1))))))>1,1,(MAX(0,(0.5-((AVERAGE($T$30:T55)-$AY$22)/(IF(STDEV($T$30:T55)<0.01,0.01,STDEV($T$30:T55)))*SQRT(COUNT($T$30:T55))/(2*(COUNT($T$30:T55)-1)))))))","v":{"$error":"#DIV/0!"}},{"$f":"IF((MAX(0,(0.5-((AVERAGE($AA$30:AA55)-$AZ$22)/(IF(STDEV($AA$30:AA55)<0.01,0.01,STDEV($AA$30:AA55)))*SQRT(COUNT($AA$30:AA55))/(2*(COUNT($AA$30:AA55)-1))))))>1,1,(MAX(0,(0.5-((AVERAGE($AA$30:AA55)-$AZ$22)/(IF(STDEV($AA$30:AA55)<0.01,0.01,STDEV($AA$30:AA55)))*SQRT(COUNT($AA$30:AA55))/(2*(COUNT($AA$30:AA55)-1)))))))","v":{"$error":"#DIV/0!"}},{"$f":"IF((MAX(0,(0.5-((AVERAGE($AB$30:AB55)-$BA$22)/(IF(STDEV($AB$30:AB55)<0.01,0.01,STDEV($AB$30:AB55)))*SQRT(COUNT($AB$30:AB55))/(2*(COUNT($AB$30:AB55)-1))))))>1,1,(MAX(0,(0.5-((AVERAGE($AB$30:AB55)-$BA$22)/(IF(STDEV($AB$30:AB55)<0.01,0.01,STDEV($AB$30:AB55)))*SQRT(COUNT($AB$30:AB55))/(2*(COUNT($AB$30:AB55)-1)))))))","v":{"$error":"#DIV/0!"}},null,null,{"$f":"(0.5 * ((100-(BETADIST(AK55,((COUNT(M$30:M55))/2)-1,((COUNT(M$30:M55))/2)-1))*100) + (100-(BETADIST(AV55,((COUNT(M$30:M55))/2)-1,((COUNT(M$30:M55))/2)-1))*100) - 100) + 55) / 100","v":{"$error":"#VALUE!"}},{"$f":"(0.5 * ((100-(BETADIST(AL55,((COUNT(N$30:N55))/2)-1,((COUNT(N$30:N55))/2)-1))*100) + (100-(BETADIST(AW55,((COUNT(N$30:N55))/2)-1,((COUNT(N$30:N55))/2)-1))*100) - 100) + 55) / 100","v":{"$error":"#VALUE!"}},{"$f":"(0.5 * ((100-(BETADIST(AQ55,((COUNT(S$30:S55))/2)-1,((COUNT(S$30:S55))/2)-1))*100) + (100-(BETADIST(AX55,((COUNT(S$30:S55))/2)-1,((COUNT(S$30:S55))/2)-1))*100) - 100) + 55) / 100","v":{"$error":"#VALUE!"}},{"$f":"(0.5 * ((100-(BETADIST(AR55,((COUNT(T$30:T55))/2)-1,((COUNT(T$30:T55))/2)-1))*100) + (100-(BETADIST(AY55,((COUNT(T$30:T55))/2)-1,((COUNT(T$30:T55))/2)-1))*100) - 100) + 55) / 100","v":{"$error":"#VALUE!"}},{"$f":"(0.5 * ((100-(BETADIST(AS55,((COUNT(AA$30:AA55))/2)-1,((COUNT(AA$30:AA55))/2)-1))*100) + (100-(BETADIST(AZ55,((COUNT(AA$30:AA55))/2)-1,((COUNT(AA$30:AA55))/2)-1))*100) - 100) + 55) / 100","v":{"$error":"#DIV/0!"}},{"$f":"(0.5 * ((100-(BETADIST(AT55,((COUNT(AB$30:AB55))/2)-1,((COUNT(AB$30:AB55))/2)-1))*100) + (100-(BETADIST(BA55,((COUNT(AB$30:AB55))/2)-1,((COUNT(AB$30:AB55))/2)-1))*100) - 100) + 55) / 100","v":{"$error":"#VALUE!"}},{"$error":"#VALUE!"},null,null,null,null,null,null,null,null,null,null,null,null,null,null,null,null,null,null,null,null,null,null,null,null,null,null,null,null,null,null,null,null,null,null,null,null,null,null,null,null,null,null,null,"2009-09-18",null,1,26,null,null,null,null,null,null,null,null,40,null,11,null,null,7.8,5.16,92.1,92.3,92.2]
[null,null,null,null,null,null,null,null,null,null,null,null,null,null,null,null,null,null,null,null,null,null,null,null,null,null,"","",null,null,0,0,0,0,0,0,{"$f":"IF((MAX(0,(0.5-(($AK$21-AVERAGE($M$30:M56))/(IF(STDEV($M$30:M56)<0.01,0.01,STDEV($M$30:M56)))*SQRT(COUNT($M$30:M56))/(2*(COUNT($M$30:M56)-1))))))>1,1,(MAX(0,(0.5-(($AK$21-AVERAGE($M$30:M56))/(IF(STDEV($M$30:M56)<0.01,0.01,STDEV($M$30:M56)))*SQRT(COUNT($M$30:M56))/(2*(COUNT($M$30:M56)-1)))))))","v":{"$error":"#VALUE!"}},{"$f":"IF((MAX(0,(0.5-(($AL$21-AVERAGE($N$30:N56))/(IF(STDEV($N$30:N56)<0.01,0.01,STDEV($N$30:N56)))*SQRT(COUNT($N$30:N56))/(2*(COUNT($N$30:N56)-1))))))>1,1,(MAX(0,(0.5-(($AL$21-AVERAGE($N$30:N56))/(IF(STDEV($N$30:N56)<0.01,0.01,STDEV($N$30:N56)))*SQRT(COUNT($N$30:N56))/(2*(COUNT($N$30:N56)-1)))))))","v":{"$error":"#VALUE!"}},0,0,0,0,{"$f":"IF((MAX(0,(0.5-(($AQ$21-AVERAGE($S$30:S56))/(IF(STDEV($S$30:S56)<0.01,0.01,STDEV($S$30:S56)))*SQRT(COUNT($S$30:S56))/(2*(COUNT($S$30:S56)-1))))))>1,1,(MAX(0,(0.5-(($AQ$21-AVERAGE($S$30:S56))/(IF(STDEV($S$30:S56)<0.01,0.01,STDEV($S$30:S56)))*SQRT(COUNT($S$30:S56))/(2*(COUNT($S$30:S56)-1)))))))","v":{"$error":"#VALUE!"}},{"$f":"IF((MAX(0,(0.5-(($AR$21-AVERAGE($T$30:T56))/(IF(STDEV($T$30:T56)<0.01,0.01,STDEV($T$30:T56)))*SQRT(COUNT($T$30:T56))/(2*(COUNT($T$30:T56)-1))))))>1,1,(MAX(0,(0.5-(($AR$21-AVERAGE($T$30:T56))/(IF(STDEV($T$30:T56)<0.01,0.01,STDEV($T$30:T56)))*SQRT(COUNT($T$30:T56))/(2*(COUNT($T$30:T56)-1)))))))","v":{"$error":"#VALUE!"}},{"$f":"IF((MAX(0,(0.5-(($AS$21-AVERAGE($AA$30:AA56))/(IF(STDEV($AA$30:AA56)<0.01,0.01,STDEV($AA$30:AA56)))*SQRT(COUNT($AA$30:AA56))/(2*(COUNT($AA$30:AA56)-1))))))>1,1,(MAX(0,(0.5-(($AS$21-AVERAGE($AA$30:AA56))/(IF(STDEV($AA$30:AA56)<0.01,0.01,STDEV($AA$30:AA56)))*SQRT(COUNT($AA$30:AA56))/(2*(COUNT($AA$30:AA56)-1)))))))","v":{"$error":"#DIV/0!"}},{"$f":"IF((MAX(0,(0.5-(($AT$21-AVERAGE($AB$30:AB56))/(IF(STDEV($AB$30:AB56)<0.01,0.01,STDEV($AB$30:AB56)))*SQRT(COUNT($AB$30:AB56))/(2*(COUNT($AB$30:AB56)-1))))))>1,1,(MAX(0,(0.5-(($AT$21-AVERAGE($AB$30:AB56))/(IF(STDEV($AB$30:AB56)<0.01,0.01,STDEV($AB$30:AB56)))*SQRT(COUNT($AB$30:AB56))/(2*(COUNT($AB$30:AB56)-1)))))))","v":{"$error":"#VALUE!"}},null,{"$f":"IF((MAX(0,(0.5-((AVERAGE($M$30:M56)-$AV$22)/(IF(STDEV($M$30:M56)<0.01,0.01,STDEV($M$30:M56)))*SQRT(COUNT($M$30:M56))/(2*(COUNT($M$30:M56)-1))))))>1,1,(MAX(0,(0.5-((AVERAGE($M$30:M56)-$AV$22)/(IF(STDEV($M$30:M56)<0.01,0.01,STDEV($M$30:M56)))*SQRT(COUNT($M$30:M56))/(2*(COUNT($M$30:M56)-1)))))))","v":{"$error":"#DIV/0!"}},{"$f":"IF((MAX(0,(0.5-((AVERAGE($N$30:N56)-$AW$22)/(IF(STDEV($N$30:N56)<0.01,0.01,STDEV($N$30:N56)))*SQRT(COUNT($N$30:N56))/(2*(COUNT($N$30:N56)-1))))))>1,1,(MAX(0,(0.5-((AVERAGE($N$30:N56)-$AW$22)/(IF(STDEV($N$30:N56)<0.01,0.01,STDEV($N$30:N56)))*SQRT(COUNT($N$30:N56))/(2*(COUNT($N$30:N56)-1)))))))","v":{"$error":"#DIV/0!"}},{"$f":"IF((MAX(0,(0.5-((AVERAGE($S$30:S56)-$AX$22)/(IF(STDEV($S$30:S56)<0.01,0.01,STDEV($S$30:S56)))*SQRT(COUNT($S$30:S56))/(2*(COUNT($S$30:S56)-1))))))>1,1,(MAX(0,(0.5-((AVERAGE($S$30:S56)-$AX$22)/(IF(STDEV($S$30:S56)<0.01,0.01,STDEV($S$30:S56)))*SQRT(COUNT($S$30:S56))/(2*(COUNT($S$30:S56)-1)))))))","v":{"$error":"#DIV/0!"}},{"$f":"IF((MAX(0,(0.5-((AVERAGE($T$30:T56)-$AY$22)/(IF(STDEV($T$30:T56)<0.01,0.01,STDEV($T$30:T56)))*SQRT(COUNT($T$30:T56))/(2*(COUNT($T$30:T56)-1))))))>1,1,(MAX(0,(0.5-((AVERAGE($T$30:T56)-$AY$22)/(IF(STDEV($T$30:T56)<0.01,0.01,STDEV($T$30:T56)))*SQRT(COUNT($T$30:T56))/(2*(COUNT($T$30:T56)-1)))))))","v":{"$error":"#DIV/0!"}},{"$f":"IF((MAX(0,(0.5-((AVERAGE($AA$30:AA56)-$AZ$22)/(IF(STDEV($AA$30:AA56)<0.01,0.01,STDEV($AA$30:AA56)))*SQRT(COUNT($AA$30:AA56))/(2*(COUNT($AA$30:AA56)-1))))))>1,1,(MAX(0,(0.5-((AVERAGE($AA$30:AA56)-$AZ$22)/(IF(STDEV($AA$30:AA56)<0.01,0.01,STDEV($AA$30:AA56)))*SQRT(COUNT($AA$30:AA56))/(2*(COUNT($AA$30:AA56)-1)))))))","v":{"$error":"#DIV/0!"}},{"$f":"IF((MAX(0,(0.5-((AVERAGE($AB$30:AB56)-$BA$22)/(IF(STDEV($AB$30:AB56)<0.01,0.01,STDEV($AB$30:AB56)))*SQRT(COUNT($AB$30:AB56))/(2*(COUNT($AB$30:AB56)-1))))))>1,1,(MAX(0,(0.5-((AVERAGE($AB$30:AB56)-$BA$22)/(IF(STDEV($AB$30:AB56)<0.01,0.01,STDEV($AB$30:AB56)))*SQRT(COUNT($AB$30:AB56))/(2*(COUNT($AB$30:AB56)-1)))))))","v":{"$error":"#DIV/0!"}},null,null,{"$f":"(0.5 * ((100-(BETADIST(AK56,((COUNT(M$30:M56))/2)-1,((COUNT(M$30:M56))/2)-1))*100) + (100-(BETADIST(AV56,((COUNT(M$30:M56))/2)-1,((COUNT(M$30:M56))/2)-1))*100) - 100) + 55) / 100","v":{"$error":"#VALUE!"}},{"$f":"(0.5 * ((100-(BETADIST(AL56,((COUNT(N$30:N56))/2)-1,((COUNT(N$30:N56))/2)-1))*100) + (100-(BETADIST(AW56,((COUNT(N$30:N56))/2)-1,((COUNT(N$30:N56))/2)-1))*100) - 100) + 55) / 100","v":{"$error":"#VALUE!"}},{"$f":"(0.5 * ((100-(BETADIST(AQ56,((COUNT(S$30:S56))/2)-1,((COUNT(S$30:S56))/2)-1))*100) + (100-(BETADIST(AX56,((COUNT(S$30:S56))/2)-1,((COUNT(S$30:S56))/2)-1))*100) - 100) + 55) / 100","v":{"$error":"#VALUE!"}},{"$f":"(0.5 * ((100-(BETADIST(AR56,((COUNT(T$30:T56))/2)-1,((COUNT(T$30:T56))/2)-1))*100) + (100-(BETADIST(AY56,((COUNT(T$30:T56))/2)-1,((COUNT(T$30:T56))/2)-1))*100) - 100) + 55) / 100","v":{"$error":"#VALUE!"}},{"$f":"(0.5 * ((100-(BETADIST(AS56,((COUNT(AA$30:AA56))/2)-1,((COUNT(AA$30:AA56))/2)-1))*100) + (100-(BETADIST(AZ56,((COUNT(AA$30:AA56))/2)-1,((COUNT(AA$30:AA56))/2)-1))*100) - 100) + 55) / 100","v":{"$error":"#DIV/0!"}},{"$f":"(0.5 * ((100-(BETADIST(AT56,((COUNT(AB$30:AB56))/2)-1,((COUNT(AB$30:AB56))/2)-1))*100) + (100-(BETADIST(BA56,((COUNT(AB$30:AB56))/2)-1,((COUNT(AB$30:AB56))/2)-1))*100) - 100) + 55) / 100","v":{"$error":"#VALUE!"}},{"$f":"(BE56*BE$23)+(BF56*BF$23)+(BG56*BG$23)+(BH56*BH$23)+(BD56*BD$23)","v":{"$error":"#VALUE!"}},null,null,null,null,null,null,null,null,null,null,null,null,null,null,null,null,null,null,null,null,null,null,null,null,null,null,null,null,null,null,null,null,null,null,null,null,null,null,null,null,null,null,null,"2009-09-19",null,1,27,null,null,null,null,null,null,null,null,36,null,12,null,null,6.9,4.97,90.1,91.2,91.3,0.9,0.8,0.7]

{"sheet":"Verification","index":2,"n_rows":104,"n_cols":10,"rows_kept":104,"cut":false,"hidden":false,"merged":[]}
[]
[]
[]
[null,null,null,null,"Quality Characteristic",{"$f":"LotInfo!J25","v":"#8"},{"$f":"LotInfo!O25","v":"#200"},{"$f":"LotInfo!P25","v":"B.C."},{"$f":"LotInfo!Q25","v":"%MTD"},{"$f":"LotInfo!I25","v":"#4"}]
[null,null,null,null,"Target Value",{"$f":"LotInfo!J26","v":0},{"$f":"LotInfo!O26","v":0},{"$f":"LotInfo!P26","v":0},{"$f":"IF(LotInfo!Q26=\"\",\"\",LotInfo!Q26)","v":""},{"$f":"LotInfo!I26","v":0}]
[null,null,null,null,"Production Tolerance",{"$f":"LotInfo!J27","v":5},{"$f":"LotInfo!O27","v":2},{"$f":"LotInfo!P27","v":0.4},{"$f":"IF(LotInfo!Q27=\"\",\"\",LotInfo!Q27)","v":""},{"$f":"LotInfo!I27","v":5}]
[null,null,null,null,"Upper Specification Limit",{"$f":"LotInfo!J28","v":""},{"$f":"LotInfo!O28","v":""},{"$f":"LotInfo!P28","v":""},{"$f":"LotInfo!Q28","v":100},{"$f":"LotInfo!I28","v":""}]
[null,null,null,null,"Lower Specification Limit",{"$f":"LotInfo!J29","v":""},{"$f":"LotInfo!O29","v":""},{"$f":"LotInfo!P29","v":""},{"$f":"LotInfo!Q29","v":97},{"$f":"LotInfo!I29","v":""}]
[null,null,null,null,"Weighting Factor   (w)",{"$f":"LotInfo!J30","v":0.1},{"$f":"LotInfo!O30","v":0.15},{"$f":"LotInfo!P30","v":0.3},{"$f":"LotInfo!Q30","v":0.4},{"$f":"LotInfo!I30","v":0.05}]
[1]
["TEST NO.","Date","Contractor's Est","Lot No.","Sublot No"]
[null,null,"of SubLot Quantity"]
[null,null,"(tons)"]
[{"$f":"IF((QCData!A30=\"\"),\"\",QCData!A30)","v":""},{"$f":"QCData!B30","v":"00:00:00"},{"$f":"IF((QCData!C30=\"\"),\"\",QCData!C30)","v":""},{"$f":"IF((QCData!D30=\"\"),\"\",QCData!D30)","v":""},{"$f":"IF((QCData!E30=\"\"),\"\",QCData!E30)","v":""},{"$f":"IF((QCData!N30=\"\"),\"\",QCData!N30)","v":""},{"$f":"IF((QCData!S30=\"\"),\"\",QCData!S30)","v":""},{"$f":"IF((QCData!T30=\"\"),\"\",QCData!T30)","v":""},{"$f":"IF((QCData!AA30=\"\"),\"\",QCData!AA30)","v":""},{"$f":"IF((QCData!M30=\"\"),\"\",QCData!M30)","v":""}]
[{"$f":"IF((QCData!A31=\"\"),\"\",QCData!A31)","v":""},{"$f":"QCData!B31","v":"00:00:00"},{"$f":"IF((QCData!C31=\"\"),\"\",QCData!C31)","v":""},{"$f":"IF((QCData!D31=\"\"),\"\",QCData!D31)","v":""},{"$f":"IF((QCData!E31=\"\"),\"\",QCData!E31)","v":""},{"$f":"IF((QCData!N31=\"\"),\"\",QCData!N31)","v":""},{"$f":"IF((QCData!S31=\"\"),\"\",QCData!S31)","v":""},{"$f":"IF((QCData!T31=\"\"),\"\",QCData!T31)","v":""},{"$f":"IF((QCData!AA31=\"\"),\"\",QCData!AA31)","v":""},{"$f":"IF((QCData!M31=\"\"),\"\",QCData!M31)","v":""}]
[{"$f":"IF((QCData!A32=\"\"),\"\",QCData!A32)","v":""},{"$f":"QCData!B32","v":"00:00:00"},{"$f":"IF((QCData!C32=\"\"),\"\",QCData!C32)","v":""},{"$f":"IF((QCData!D32=\"\"),\"\",QCData!D32)","v":""},{"$f":"IF((QCData!E32=\"\"),\"\",QCData!E32)","v":""},{"$f":"IF((QCData!N32=\"\"),\"\",QCData!N32)","v":""},{"$f":"IF((QCData!S32=\"\"),\"\",QCData!S32)","v":""},{"$f":"IF((QCData!T32=\"\"),\"\",QCData!T32)","v":""},{"$f":"IF((QCData!AA32=\"\"),\"\",QCData!AA32)","v":""},{"$f":"IF((QCData!M32=\"\"),\"\",QCData!M32)","v":""}]
[{"$f":"IF((QCData!A33=\"\"),\"\",QCData!A33)","v":""},{"$f":"QCData!B33","v":"00:00:00"},{"$f":"IF((QCData!C33=\"\"),\"\",QCData!C33)","v":""},{"$f":"IF((QCData!D33=\"\"),\"\",QCData!D33)","v":""},{"$f":"IF((QCData!E33=\"\"),\"\",QCData!E33)","v":""},{"$f":"IF((QCData!N33=\"\"),\"\",QCData!N33)","v":""},{"$f":"IF((QCData!S33=\"\"),\"\",QCData!S33)","v":""},{"$f":"IF((QCData!T33=\"\"),\"\",QCData!T33)","v":""},{"$f":"IF((QCData!AA33=\"\"),\"\",QCData!AA33)","v":""},{"$f":"IF((QCData!M33=\"\"),\"\",QCData!M33)","v":""}]
[{"$f":"IF((QCData!A34=\"\"),\"\",QCData!A34)","v":""},{"$f":"QCData!B34","v":"00:00:00"},{"$f":"IF((QCData!C34=\"\"),\"\",QCData!C34)","v":""},{"$f":"IF((QCData!D34=\"\"),\"\",QCData!D34)","v":""},{"$f":"IF((QCData!E34=\"\"),\"\",QCData!E34)","v":""},{"$f":"IF((QCData!N34=\"\"),\"\",QCData!N34)","v":""},{"$f":"IF((QCData!S34=\"\"),\"\",QCData!S34)","v":""},{"$f":"IF((QCData!T34=\"\"),\"\",QCData!T34)","v":""},{"$f":"IF((QCData!AA34=\"\"),\"\",QCData!AA34)","v":""},{"$f":"IF((QCData!M34=\"\"),\"\",QCData!M34)","v":""}]
[{"$f":"IF((QCData!A35=\"\"),\"\",QCData!A35)","v":""},{"$f":"QCData!B35","v":"00:00:00"},{"$f":"IF((QCData!C35=\"\"),\"\",QCData!C35)","v":""},{"$f":"IF((QCData!D35=\"\"),\"\",QCData!D35)","v":""},{"$f":"IF((QCData!E35=\"\"),\"\",QCData!E35)","v":""},{"$f":"IF((QCData!N35=\"\"),\"\",QCData!N35)","v":""},{"$f":"IF((QCData!S35=\"\"),\"\",QCData!S35)","v":""},{"$f":"IF((QCData!T35=\"\"),\"\",QCData!T35)","v":""},{"$f":"IF((QCData!AA35=\"\"),\"\",QCData!AA35)","v":""},{"$f":"IF((QCData!M35=\"\"),\"\",QCData!M35)","v":""}]
[{"$f":"IF((QCData!A36=\"\"),\"\",QCData!A36)","v":""},{"$f":"QCData!B36","v":"00:00:00"},{"$f":"IF((QCData!C36=\"\"),\"\",QCData!C36)","v":""},{"$f":"IF((QCData!D36=\"\"),\"\",QCData!D36)","v":""},{"$f":"IF((QCData!E36=\"\"),\"\",QCData!E36)","v":""},{"$f":"IF((QCData!N36=\"\"),\"\",QCData!N36)","v":""},{"$f":"IF((QCData!S36=\"\"),\"\",QCData!S36)","v":""},{"$f":"IF((QCData!T36=\"\"),\"\",QCData!T36)","v":""},{"$f":"IF((QCData!AA36=\"\"),\"\",QCData!AA36)","v":""},{"$f":"IF((QCData!M36=\"\"),\"\",QCData!M36)","v":""}]
[{"$f":"IF((QCData!A37=\"\"),\"\",QCData!A37)","v":""},{"$f":"QCData!B37","v":"00:00:00"},{"$f":"IF((QCData!C37=\"\"),\"\",QCData!C37)","v":""},{"$f":"IF((QCData!D37=\"\"),\"\",QCData!D37)","v":""},{"$f":"IF((QCData!E37=\"\"),\"\",QCData!E37)","v":""},{"$f":"IF((QCData!N37=\"\"),\"\",QCData!N37)","v":""},{"$f":"IF((QCData!S37=\"\"),\"\",QCData!S37)","v":""},{"$f":"IF((QCData!T37=\"\"),\"\",QCData!T37)","v":""},{"$f":"IF((QCData!AA37=\"\"),\"\",QCData!AA37)","v":""},{"$f":"IF((QCData!M37=\"\"),\"\",QCData!M37)","v":""}]
[{"$f":"IF((QCData!A38=\"\"),\"\",QCData!A38)","v":""},{"$f":"QCData!B38","v":"00:00:00"},{"$f":"IF((QCData!C38=\"\"),\"\",QCData!C38)","v":""},{"$f":"IF((QCData!D38=\"\"),\"\",QCData!D38)","v":""},{"$f":"IF((QCData!E38=\"\"),\"\",QCData!E38)","v":""},{"$f":"IF((QCData!N38=\"\"),\"\",QCData!N38)","v":""},{"$f":"IF((QCData!S38=\"\"),\"\",QCData!S38)","v":""},{"$f":"IF((QCData!T38=\"\"),\"\",QCData!T38)","v":""},{"$f":"IF((QCData!AA38=\"\"),\"\",QCData!AA38)","v":""},{"$f":"IF((QCData!M38=\"\"),\"\",QCData!M38)","v":""}]
[{"$f":"IF((QCData!A39=\"\"),\"\",QCData!A39)","v":""},{"$f":"QCData!B39","v":"00:00:00"},{"$f":"IF((QCData!C39=\"\"),\"\",QCData!C39)","v":""},{"$f":"IF((QCData!D39=\"\"),\"\",QCData!D39)","v":""},{"$f":"IF((QCData!E39=\"\"),\"\",QCData!E39)","v":""},{"$f":"IF((QCData!N39=\"\"),\"\",QCData!N39)","v":""},{"$f":"IF((QCData!S39=\"\"),\"\",QCData!S39)","v":""},{"$f":"IF((QCData!T39=\"\"),\"\",QCData!T39)","v":""},{"$f":"IF((QCData!AA39=\"\"),\"\",QCData!AA39)","v":""},{"$f":"IF((QCData!M39=\"\"),\"\",QCData!M39)","v":""}]
[{"$f":"IF((QCData!A40=\"\"),\"\",QCData!A40)","v":""},{"$f":"QCData!B40","v":"00:00:00"},{"$f":"IF((QCData!C40=\"\"),\"\",QCData!C40)","v":""},{"$f":"IF((QCData!D40=\"\"),\"\",QCData!D40)","v":""},{"$f":"IF((QCData!E40=\"\"),\"\",QCData!E40)","v":""},{"$f":"IF((QCData!N40=\"\"),\"\",QCData!N40)","v":""},{"$f":"IF((QCData!S40=\"\"),\"\",QCData!S40)","v":""},{"$f":"IF((QCData!T40=\"\"),\"\",QCData!T40)","v":""},{"$f":"IF((QCData!AA40=\"\"),\"\",QCData!AA40)","v":""},{"$f":"IF((QCData!M40=\"\"),\"\",QCData!M40)","v":""}]
[{"$f":"IF((QCData!A41=\"\"),\"\",QCData!A41)","v":""},{"$f":"QCData!B41","v":"00:00:00"},{"$f":"IF((QCData!C41=\"\"),\"\",QCData!C41)","v":""},{"$f":"IF((QCData!D41=\"\"),\"\",QCData!D41)","v":""},{"$f":"IF((QCData!E41=\"\"),\"\",QCData!E41)","v":""},{"$f":"IF((QCData!N41=\"\"),\"\",QCData!N41)","v":""},{"$f":"IF((QCData!S41=\"\"),\"\",QCData!S41)","v":""},{"$f":"IF((QCData!T41=\"\"),\"\",QCData!T41)","v":""},{"$f":"IF((QCData!AA41=\"\"),\"\",QCData!AA41)","v":""},{"$f":"IF((QCData!M41=\"\"),\"\",QCData!M41)","v":""}]
[{"$f":"IF((QCData!A42=\"\"),\"\",QCData!A42)","v":""},{"$f":"QCData!B42","v":"00:00:00"},{"$f":"IF((QCData!C42=\"\"),\"\",QCData!C42)","v":""},{"$f":"IF((QCData!D42=\"\"),\"\",QCData!D42)","v":""},{"$f":"IF((QCData!E42=\"\"),\"\",QCData!E42)","v":""},{"$f":"IF((QCData!N42=\"\"),\"\",QCData!N42)","v":""},{"$f":"IF((QCData!S42=\"\"),\"\",QCData!S42)","v":""},{"$f":"IF((QCData!T42=\"\"),\"\",QCData!T42)","v":""},{"$f":"IF((QCData!AA42=\"\"),\"\",QCData!AA42)","v":""},{"$f":"IF((QCData!M42=\"\"),\"\",QCData!M42)","v":""}]
[{"$f":"IF((QCData!A43=\"\"),\"\",QCData!A43)","v":""},{"$f":"QCData!B43","v":"00:00:00"},{"$f":"IF((QCData!C43=\"\"),\"\",QCData!C43)","v":""},{"$f":"IF((QCData!D43=\"\"),\"\",QCData!D43)","v":""},{"$f":"IF((QCData!E43=\"\"),\"\",QCData!E43)","v":""},{"$f":"IF((QCData!N43=\"\"),\"\",QCData!N43)","v":""},{"$f":"IF((QCData!S43=\"\"),\"\",QCData!S43)","v":""},{"$f":"IF((QCData!T43=\"\"),\"\",QCData!T43)","v":""},{"$f":"IF((QCData!AA43=\"\"),\"\",QCData!AA43)","v":""},{"$f":"IF((QCData!M43=\"\"),\"\",QCData!M43)","v":""}]
[{"$f":"IF((QCData!A44=\"\"),\"\",QCData!A44)","v":""},{"$f":"QCData!B44","v":"00:00:00"},{"$f":"IF((QCData!C44=\"\"),\"\",QCData!C44)","v":""},{"$f":"IF((QCData!D44=\"\"),\"\",QCData!D44)","v":""},{"$f":"IF((QCData!E44=\"\"),\"\",QCData!E44)","v":""},{"$f":"IF((QCData!N44=\"\"),\"\",QCData!N44)","v":""},{"$f":"IF((QCData!S44=\"\"),\"\",QCData!S44)","v":""},{"$f":"IF((QCData!T44=\"\"),\"\",QCData!T44)","v":""},{"$f":"IF((QCData!AA44=\"\"),\"\",QCData!AA44)","v":""},{"$f":"IF((QCData!M44=\"\"),\"\",QCData!M44)","v":""}]
[{"$f":"IF((QCData!A45=\"\"),\"\",QCData!A45)","v":""},{"$f":"QCData!B45","v":"00:00:00"},{"$f":"IF((QCData!C45=\"\"),\"\",QCData!C45)","v":""},{"$f":"IF((QCData!D45=\"\"),\"\",QCData!D45)","v":""},{"$f":"IF((QCData!E45=\"\"),\"\",QCData!E45)","v":""},{"$f":"IF((QCData!N45=\"\"),\"\",QCData!N45)","v":""},{"$f":"IF((QCData!S45=\"\"),\"\",QCData!S45)","v":""},{"$f":"IF((QCData!T45=\"\"),\"\",QCData!T45)","v":""},{"$f":"IF((QCData!AA45=\"\"),\"\",QCData!AA45)","v":""},{"$f":"IF((QCData!M45=\"\"),\"\",QCData!M45)","v":""}]
[{"$f":"IF((QCData!A46=\"\"),\"\",QCData!A46)","v":""},{"$f":"QCData!B46","v":"00:00:00"},{"$f":"IF((QCData!C46=\"\"),\"\",QCData!C46)","v":""},{"$f":"IF((QCData!D46=\"\"),\"\",QCData!D46)","v":""},{"$f":"IF((QCData!E46=\"\"),\"\",QCData!E46)","v":""},{"$f":"IF((QCData!N46=\"\"),\"\",QCData!N46)","v":""},{"$f":"IF((QCData!S46=\"\"),\"\",QCData!S46)","v":""},{"$f":"IF((QCData!T46=\"\"),\"\",QCData!T46)","v":""},{"$f":"IF((QCData!AA46=\"\"),\"\",QCData!AA46)","v":""},{"$f":"IF((QCData!M46=\"\"),\"\",QCData!M46)","v":""}]
[{"$f":"IF((QCData!A47=\"\"),\"\",QCData!A47)","v":""},{"$f":"QCData!B47","v":"00:00:00"},{"$f":"IF((QCData!C47=\"\"),\"\",QCData!C47)","v":""},{"$f":"IF((QCData!D47=\"\"),\"\",QCData!D47)","v":""},{"$f":"IF((QCData!E47=\"\"),\"\",QCData!E47)","v":""},{"$f":"IF((QCData!N47=\"\"),\"\",QCData!N47)","v":""},{"$f":"IF((QCData!S47=\"\"),\"\",QCData!S47)","v":""},{"$f":"IF((QCData!T47=\"\"),\"\",QCData!T47)","v":""},{"$f":"IF((QCData!AA47=\"\"),\"\",QCData!AA47)","v":""},{"$f":"IF((QCData!M47=\"\"),\"\",QCData!M47)","v":""}]
[{"$f":"IF((QCData!A48=\"\"),\"\",QCData!A48)","v":""},{"$f":"QCData!B48","v":"00:00:00"},{"$f":"IF((QCData!C48=\"\"),\"\",QCData!C48)","v":""},{"$f":"IF((QCData!D48=\"\"),\"\",QCData!D48)","v":""},{"$f":"IF((QCData!E48=\"\"),\"\",QCData!E48)","v":""},{"$f":"IF((QCData!N48=\"\"),\"\",QCData!N48)","v":""},{"$f":"IF((QCData!S48=\"\"),\"\",QCData!S48)","v":""},{"$f":"IF((QCData!T48=\"\"),\"\",QCData!T48)","v":""},{"$f":"IF((QCData!AA48=\"\"),\"\",QCData!AA48)","v":""},{"$f":"IF((QCData!M48=\"\"),\"\",QCData!M48)","v":""}]
[{"$f":"IF((QCData!A49=\"\"),\"\",QCData!A49)","v":""},{"$f":"QCData!B49","v":"00:00:00"},{"$f":"IF((QCData!C49=\"\"),\"\",QCData!C49)","v":""},{"$f":"IF((QCData!D49=\"\"),\"\",QCData!D49)","v":""},{"$f":"IF((QCData!E49=\"\"),\"\",QCData!E49)","v":""},{"$f":"IF((QCData!N49=\"\"),\"\",QCData!N49)","v":""},{"$f":"IF((QCData!S49=\"\"),\"\",QCData!S49)","v":""},{"$f":"IF((QCData!T49=\"\"),\"\",QCData!T49)","v":""},{"$f":"IF((QCData!AA49=\"\"),\"\",QCData!AA49)","v":""},{"$f":"IF((QCData!M49=\"\"),\"\",QCData!M49)","v":""}]
[{"$f":"IF((QCData!A50=\"\"),\"\",QCData!A50)","v":""},{"$f":"QCData!B50","v":"00:00:00"},{"$f":"IF((QCData!C50=\"\"),\"\",QCData!C50)","v":""},{"$f":"IF((QCData!D50=\"\"),\"\",QCData!D50)","v":""},{"$f":"IF((QCData!E50=\"\"),\"\",QCData!E50)","v":""},{"$f":"IF((QCData!N50=\"\"),\"\",QCData!N50)","v":""},{"$f":"IF((QCData!S50=\"\"),\"\",QCData!S50)","v":""},{"$f":"IF((QCData!T50=\"\"),\"\",QCData!T50)","v":""},{"$f":"IF((QCData!AA50=\"\"),\"\",QCData!AA50)","v":""},{"$f":"IF((QCData!M50=\"\"),\"\",QCData!M50)","v":""}]
[{"$f":"IF((QCData!A51=\"\"),\"\",QCData!A51)","v":""},{"$f":"QCData!B51","v":"00:00:00"},{"$f":"IF((QCData!C51=\"\"),\"\",QCData!C51)","v":""},{"$f":"IF((QCData!D51=\"\"),\"\",QCData!D51)","v":""},{"$f":"IF((QCData!E51=\"\"),\"\",QCData!E51)","v":""},{"$f":"IF((QCData!N51=\"\"),\"\",QCData!N51)","v":""},{"$f":"IF((QCData!S51=\"\"),\"\",QCData!S51)","v":""},{"$f":"IF((QCData!T51=\"\"),\"\",QCData!T51)","v":""},{"$f":"IF((QCData!AA51=\"\"),\"\",QCData!AA51)","v":""},{"$f":"IF((QCData!M51=\"\"),\"\",QCData!M51)","v":""}]
[{"$f":"IF((QCData!A52=\"\"),\"\",QCData!A52)","v":""},{"$f":"QCData!B52","v":"00:00:00"},{"$f":"IF((QCData!C52=\"\"),\"\",QCData!C52)","v":""},{"$f":"IF((QCData!D52=\"\"),\"\",QCData!D52)","v":""},{"$f":"IF((QCData!E52=\"\"),\"\",QCData!E52)","v":""},{"$f":"IF((QCData!N52=\"\"),\"\",QCData!N52)","v":""},{"$f":"IF((QCData!S52=\"\"),\"\",QCData!S52)","v":""},{"$f":"IF((QCData!T52=\"\"),\"\",QCData!T52)","v":""},{"$f":"IF((QCData!AA52=\"\"),\"\",QCData!AA52)","v":""},{"$f":"IF((QCData!M52=\"\"),\"\",QCData!M52)","v":""}]
[{"$f":"IF((QCData!A53=\"\"),\"\",QCData!A53)","v":""},{"$f":"QCData!B53","v":"00:00:00"},{"$f":"IF((QCData!C53=\"\"),\"\",QCData!C53)","v":""},{"$f":"IF((QCData!D53=\"\"),\"\",QCData!D53)","v":""},{"$f":"IF((QCData!E53=\"\"),\"\",QCData!E53)","v":""},{"$f":"IF((QCData!N53=\"\"),\"\",QCData!N53)","v":""},{"$f":"IF((QCData!S53=\"\"),\"\",QCData!S53)","v":""},{"$f":"IF((QCData!T53=\"\"),\"\",QCData!T53)","v":""},{"$f":"IF((QCData!AA53=\"\"),\"\",QCData!AA53)","v":""},{"$f":"IF((QCData!M53=\"\"),\"\",QCData!M53)","v":""}]
[{"$f":"IF((QCData!A54=\"\"),\"\",QCData!A54)","v":""},{"$f":"QCData!B54","v":"00:00:00"},{"$f":"IF((QCData!C54=\"\"),\"\",QCData!C54)","v":""},{"$f":"IF((QCData!D54=\"\"),\"\",QCData!D54)","v":""},{"$f":"IF((QCData!E54=\"\"),\"\",QCData!E54)","v":""},{"$f":"IF((QCData!N54=\"\"),\"\",QCData!N54)","v":""},{"$f":"IF((QCData!S54=\"\"),\"\",QCData!S54)","v":""},{"$f":"IF((QCData!T54=\"\"),\"\",QCData!T54)","v":""},{"$f":"IF((QCData!AA54=\"\"),\"\",QCData!AA54)","v":""},{"$f":"IF((QCData!M54=\"\"),\"\",QCData!M54)","v":""}]
[{"$f":"IF((QCData!A55=\"\"),\"\",QCData!A55)","v":""},{"$f":"QCData!B55","v":"00:00:00"},{"$f":"IF((QCData!C55=\"\"),\"\",QCData!C55)","v":""},{"$f":"IF((QCData!D55=\"\"),\"\",QCData!D55)","v":""},{"$f":"IF((QCData!E55=\"\"),\"\",QCData!E55)","v":""},{"$f":"IF((QCData!N55=\"\"),\"\",QCData!N55)","v":""},{"$f":"IF((QCData!S55=\"\"),\"\",QCData!S55)","v":""},{"$f":"IF((QCData!T55=\"\"),\"\",QCData!T55)","v":""},{"$f":"IF((QCData!AA55=\"\"),\"\",QCData!AA55)","v":""},{"$f":"IF((QCData!M55=\"\"),\"\",QCData!M55)","v":""}]
[{"$f":"IF((QCData!A56=\"\"),\"\",QCData!A56)","v":""},{"$f":"QCData!B56","v":"00:00:00"},{"$f":"IF((QCData!C56=\"\"),\"\",QCData!C56)","v":""},{"$f":"IF((QCData!D56=\"\"),\"\",QCData!D56)","v":""},{"$f":"IF((QCData!E56=\"\"),\"\",QCData!E56)","v":""},{"$f":"IF((QCData!N56=\"\"),\"\",QCData!N56)","v":""},{"$f":"IF((QCData!S56=\"\"),\"\",QCData!S56)","v":""},{"$f":"IF((QCData!T56=\"\"),\"\",QCData!T56)","v":""},{"$f":"IF((QCData!AA56=\"\"),\"\",QCData!AA56)","v":""},{"$f":"IF((QCData!M56=\"\"),\"\",QCData!M56)","v":""}]
[]
[]
["Engineer Verification Test Data"]
["TEST NO.","Date",null,"Lot No.","Sublot No"]
[]
[]
[]
[]
[]
[]
[]
[]
[]
[]
[]
[]
[]
[]
[]
[]
[]
[]
[]
[]
[]
[]
[]
[]
[]
[]
[]
[]
[]
["Verification Report"]
[null,null,null,null,"Quality Characteristic",{"$f":"LotInfo!J25","v":"#8"},{"$f":"LotInfo!O25","v":"#200"},{"$f":"LotInfo!P25","v":"B.C."},{"$f":"LotInfo!Q25","v":"%MTD"},{"$f":"LotInfo!I25","v":"#4"}]
[null,null,"Sp",null,null,{"$f":"SQRT(( (  (STDEV(F14:F40)^2*(COUNT(F14:F40)-1))  + (STDEV(F45:F71)^2*(COUNT(F45:F71)-1)) ) / (COUNT(F14:F40)+COUNT(F45:F71)-2) ))","v":{"$error":"#DIV/0!"}},{"$f":"SQRT(( (  (STDEV(G14:G40)^2*(COUNT(G14:G40)-1))  + (STDEV(G45:G71)^2*(COUNT(G45:G71)-1)) ) / (COUNT(G14:G40)+COUNT(G45:G71)-2) ))","v":{"$error":"#DIV/0!"}},{"$f":"SQRT(( (  (STDEV(H14:H40)^2*(COUNT(H14:H40)-1))  + (STDEV(H45:H71)^2*(COUNT(H45:H71)-1)) ) / (COUNT(H14:H40)+COUNT(H45:H71)-2) ))","v":{"$error":"#DIV/0!"}},{"$error":"#DIV/0!"},{"$error":"#DIV/0!"}]
[null,null,"F value",null,null,{"$f":"IF(AND(ISNUMBER(STDEV(F14:F40)),(ISNUMBER(STDEV(F45:F71)))),STDEV(F45:F71)^2/STDEV(F14:F40)^2,\"\")","v":""},{"$f":"IF(AND(ISNUMBER(STDEV(G14:G40)),(ISNUMBER(STDEV(G45:G71)))),STDEV(G45:G71)^2/STDEV(G14:G40)^2,\"\")","v":""},{"$f":"IF(AND(ISNUMBER(STDEV(H14:H40)),(ISNUMBER(STDEV(H45:H71)))),STDEV(H45:H71)^2/STDEV(H14:H40)^2,\"\")","v":""},"",""]
[null,null,"numerator (nv-1) for Fcrit Lookup",null,null,{"$f":"IF(ISNUMBER(   COUNT(F45:F71)   ), COUNT(F45:F71)-1,\"\")","v":-1},{"$f":"IF(ISNUMBER(   COUNT(G45:G71)   ), COUNT(G45:G71)-1,\"\")","v":-1},{"$f":"IF(ISNUMBER(   COUNT(H45:H71)   ), COUNT(H45:H71)-1,\"\")","v":-1},-1,-1]
[null,null,"denominator (nc-1) for Fcrit Lookup",null,null,{"$f":"IF(ISNUMBER(COUNT(F14:F40)), COUNT(F14:F40)-1,\"\")","v":-1},{"$f":"IF(ISNUMBER(COUNT(G14:G40)), COUNT(G14:G40)-1,\"\")","v":-1},{"$f":"IF(ISNUMBER(COUNT(H14:H40)), COUNT(H14:H40)-1,\"\")","v":-1},-1,-1]
[null,null,"F crit from table F Table",null,null,{"$f":"IF((AND(ISNUMBER(F78),ISNUMBER(F79))),VLOOKUP(F78,'F Table'!$C6:$AG27,Verification!F79+1,FALSE),\"\")","v":{"$error":"#N/A"}},{"$f":"IF((AND(ISNUMBER(G78),ISNUMBER(G79))),VLOOKUP(G78,'F Table'!$C6:$AG27,Verification!G79+1,FALSE),\"\")","v":{"$error":"#N/A"}},{"$f":"IF((AND(ISNUMBER(H78),ISNUMBER(H79))),VLOOKUP(H78,'F Table'!$C6:$AG27,Verification!H79+1,FALSE),\"\")","v":{"$error":"#N/A"}},{"$f":"IF((AND(ISNUMBER(I78),ISNUMBER(I79))),VLOOKUP(I78,'F Table'!$C6:$AG27,Verification!I79+1,FALSE),\"\")","v":{"$error":"#N/A"}},{"$f":"IF((AND(ISNUMBER(J78),ISNUMBER(J79))),VLOOKUP(J78,'F Table'!$C6:$AG27,Verification!J79+1,FALSE),\"\")","v":{"$error":"#N/A"}}]
[null,null,"If F<Fcrit then \"variances assumed equal\"",null,null,{"$f":"IF(ISNUMBER(F80),(IF(F77<=F80,\"variances equal\",\"variances unequal\")),\"\")","v":""},{"$f":"IF(ISNUMBER(G80),(IF(G77<=G80,\"variances equal\",\"variances unequal\")),\"\")","v":""},{"$f":"IF(ISNUMBER(H80),(IF(H77<=H80,\"variances equal\",\"variances unequal\")),\"\")","v":""},{"$f":"IF(ISNUMBER(I80),(IF(I77<=I80,\"variances equal\",\"variances unequal\")),\"\")","v":""},{"$f":"IF(ISNUMBER(J80),(IF(J77<=J80,\"variances equal\",\"variances unequal\")),\"\")","v":""}]
[null,null,"\"t stat.\"",null,null,{"$f":"ROUND((IF(F81=\"variances equal\", (ABS(   AVERAGE(F14:F40) - AVERAGE(F45:F71)   ))/ (F76 * SQRT(1/COUNT(F14:F40) + 1/COUNT(F45:F71))),(ABS(AVERAGE(F14:F40)-AVERAGE(F45:F71)))/SQRT((STDEV(F14:F40)^2/COUNT(F14:F40))+(STDEV(F45:F71)^2/COUNT(F45:F71))))),3)","v":{"$error":"#DIV/0!"}},{"$f":"ROUND((IF(G81=\"variances equal\", (ABS(   AVERAGE(G14:G40) - AVERAGE(G45:G71)   ))/ (G76 * SQRT(1/COUNT(G14:G40) + 1/COUNT(G45:G71))),(ABS(AVERAGE(G14:G40)-AVERAGE(G45:G71)))/SQRT((STDEV(G14:G40)^2/COUNT(G14:G40))+(STDEV(G45:G71)^2/COUNT(G45:G71))))),3)","v":{"$error":"#DIV/0!"}},{"$f":"ROUND((IF(H81=\"variances equal\", (ABS(   AVERAGE(H14:H40) - AVERAGE(H45:H71)   ))/ (H76 * SQRT(1/COUNT(H14:H40) + 1/COUNT(H45:H71))),(ABS(AVERAGE(H14:H40)-AVERAGE(H45:H71)))/SQRT((STDEV(H14:H40)^2/COUNT(H14:H40))+(STDEV(H45:H71)^2/COUNT(H45:H71))))),3)","v":{"$error":"#DIV/0!"}},{"$f":"ROUND((IF(I81=\"variances equal\", (ABS(   AVERAGE(I14:I40) - AVERAGE(I45:I71)   ))/ (I76 * SQRT(1/COUNT(I14:I40) + 1/COUNT(I45:I71))),(ABS(AVERAGE(I14:I40)-AVERAGE(I45:I71)))/SQRT((STDEV(I14:I40)^2/COUNT(I14:I40))+(STDEV(I45:I71)^2/COUNT(I45:I71))))),3)","v":{"$error":"#DIV/0!"}},{"$f":"ROUND((IF(J81=\"variances equal\", (ABS(   AVERAGE(J14:J40) - AVERAGE(J45:J71)   ))/ (J76 * SQRT(1/COUNT(J14:J40) + 1/COUNT(J45:J71))),(ABS(AVERAGE(J14:J40)-AVERAGE(J45:J71)))/SQRT((STDEV(J14:J40)^2/COUNT(J14:J40))+(STDEV(J45:J71)^2/COUNT(J45:J71))))),3)","v":{"$error":"#DIV/0!"}}]
[null,null,"effective degrees of freedom (f')",null,null,{"$f":"ROUNDDOWN(((((STDEV(F14:F40)^2/COUNT(F14:F40))+(STDEV(F45:F71)^2/COUNT(F45:F71)))^2)/((((STDEV(F14:F40)^2/COUNT(F14:F40))^2)/(COUNT(F14:F40)+1))+((((STDEV(F45:F71)^2)/COUNT(F45:F71))^2)/(COUNT(F45:F71)+1))))-2,0)","v":{"$error":"#DIV/0!"}},{"$f":"ROUNDDOWN(((((STDEV(G14:G40)^2/COUNT(G14:G40))+(STDEV(G45:G71)^2/COUNT(G45:G71)))^2)/((((STDEV(G14:G40)^2/COUNT(G14:G40))^2)/(COUNT(G14:G40)+1))+((((STDEV(G45:G71)^2)/COUNT(G45:G71))^2)/(COUNT(G45:G71)+1))))-2,0)","v":{"$error":"#DIV/0!"}},{"$f":"ROUNDDOWN(((((STDEV(H14:H40)^2/COUNT(H14:H40))+(STDEV(H45:H71)^2/COUNT(H45:H71)))^2)/((((STDEV(H14:H40)^2/COUNT(H14:H40))^2)/(COUNT(H14:H40)+1))+((((STDEV(H45:H71)^2)/COUNT(H45:H71))^2)/(COUNT(H45:H71)+1))))-2,0)","v":{"$error":"#DIV/0!"}},{"$error":"#DIV/0!"},{"$error":"#DIV/0!"}]
[null,null,"t crit. (variances equal; nc+nv-2)",null,null,{"$f":"LOOKUP((COUNT(F14:F40)+COUNT(F45:F71)-2),degreefreedom,tcrit)","v":{"$error":"#N/A"}},{"$f":"LOOKUP((COUNT(G14:G40)+COUNT(G45:G71)-2),degreefreedom,tcrit)","v":{"$error":"#N/A"}},{"$f":"LOOKUP((COUNT(H14:H40)+COUNT(H45:H71)-2),degreefreedom,tcrit)","v":{"$error":"#N/A"}},{"$f":"LOOKUP((COUNT(I14:I40)+COUNT(I45:I71)-2),degreefreedom,tcrit)","v":{"$error":"#N/A"}},{"$f":"LOOKUP((COUNT(J14:J40)+COUNT(J45:J71)-2),degreefreedom,tcrit)","v":{"$error":"#N/A"}}]
[null,null,"t crit.  (variances not equal; f')",null,null,{"$f":"LOOKUP(F83,degreefreedom,tcrit)","v":{"$error":"#DIV/0!"}},{"$f":"LOOKUP(G83,degreefreedom,tcrit)","v":{"$error":"#DIV/0!"}},{"$f":"LOOKUP(H83,degreefreedom,tcrit)","v":{"$error":"#DIV/0!"}},{"$f":"LOOKUP(I83,degreefreedom,tcrit)","v":{"$error":"#DIV/0!"}},{"$f":"LOOKUP(J83,degreefreedom,tcrit)","v":{"$error":"#DIV/0!"}}]
[null,null,"t crit",null,null,{"$f":"IF(F81=\"variances equal\",F84,F85)","v":{"$error":"#DIV/0!"}},{"$f":"IF(G81=\"variances equal\",G84,G85)","v":{"$error":"#DIV/0!"}},{"$f":"IF(H81=\"variances equal\",H84,H85)","v":{"$error":"#DIV/0!"}},{"$error":"#DIV/0!"},{"$error":"#DIV/0!"}]
[null,null,"Check if enough data",null,null,{"$f":"(IF(AND(COUNT(F14:F40)<19.5,COUNT(F45:F71)>=3),\"YES\",IF(AND(COUNT(F14:F40)>19.5,COUNT(F14:F40)<24.5,COUNT(F45:F71)>=4),\"YES\",IF(AND(COUNT(F14:F40)>24.5,COUNT(F45:F71)>=5),\"YES\",\"NO\"))))","v":"NO"},{"$f":"(IF(AND(COUNT(G14:G40)<19.5,COUNT(G45:G71)>=3),\"YES\",IF(AND(COUNT(G14:G40)>19.5,COUNT(G14:G40)<24.5,COUNT(G45:G71)>=4),\"YES\",IF(AND(COUNT(G14:G40)>24.5,COUNT(G45:G71)>=5),\"YES\",\"NO\"))))","v":"NO"},{"$f":"(IF(AND(COUNT(H14:H40)<19.5,COUNT(H45:H71)>=3),\"YES\",IF(AND(COUNT(H14:H40)>19.5,COUNT(H14:H40)<24.5,COUNT(H45:H71)>=4),\"YES\",IF(AND(COUNT(H14:H40)>24.5,COUNT(H45:H71)>=5),\"YES\",\"NO\"))))","v":"NO"},"NO","NO"]
[null,null,"Is t<tcrit (Verification Pass) ",null,null,{"$f":"IF(F87=\"YES\",IF(F82<=F86,\"PASS\",\"FAIL\"),IF(N105=\"NO\",\"INS.DATA\",\"\"))","v":""},{"$f":"IF(G87=\"YES\",IF(G82<=G86,\"PASS\",\"FAIL\"),IF(O105=\"NO\",\"INS.DATA\",\"\"))","v":""},{"$f":"IF(H87=\"YES\",IF(H82<=H86,\"PASS\",\"FAIL\"),IF(P105=\"NO\",\"INS.DATA\",\"\"))","v":""},{"$f":"IF(I87=\"YES\",IF(I82<=I86,\"PASS\",\"FAIL\"),IF(Q105=\"NO\",\"INS.DATA\",\"\"))","v":""},{"$f":"IF(J87=\"YES\",IF(J82<=J86,\"PASS\",\"FAIL\"),IF(R105=\"NO\",\"INS.DATA\",\"\"))","v":""}]
[null,null,"2nd check, is IXc-XvI < All.Diff.",null,null,{"$f":"IF(F88=\"INS.DATA\",\"INS.DATA\", IF(F88=\"FAIL\", IF(ABS(AVERAGE(F14:F40)-AVERAGE(F45:F71))<=1, \"PASS\", \"FAIL\"),\"\"))","v":""},{"$f":"IF(G88=\"INS.DATA\",\"INS.DATA\", IF(G88=\"FAIL\", IF(ABS(AVERAGE(G14:G40)-AVERAGE(G45:G71))<=1, \"PASS\", \"FAIL\"),\"\"))","v":""},{"$f":"IF(H88=\"INS.DATA\",\"INS.DATA\", IF(H88=\"FAIL\", IF(ABS(AVERAGE(H14:H40)-AVERAGE(H45:H71))<=1, \"PASS\", \"FAIL\"),\"\"))","v":""},"",""]
[null,null,"Verified? (Yes/No)",null,null,{"$f":"IF(F88=\"PASS\",\"YES\", IF(F88=\"INS.DATA\", \"NO\", IF(AND(F88=\"FAIL\",F89=\"PASS\"),\"YES\", IF(AND(F88=\"FAIL\",F89=\"FAIL\"),\"NO\",\"\"))))","v":""},{"$f":"IF(G88=\"PASS\",\"YES\", IF(G88=\"INS.DATA\", \"NO\", IF(AND(G88=\"FAIL\",G89=\"PASS\"),\"YES\", IF(AND(G88=\"FAIL\",G89=\"FAIL\"),\"NO\",\"\"))))","v":""},{"$f":"IF(H88=\"PASS\",\"YES\", IF(H88=\"INS.DATA\", \"NO\", IF(AND(H88=\"FAIL\",H89=\"PASS\"),\"YES\", IF(AND(H88=\"FAIL\",H89=\"FAIL\"),\"NO\",\"\"))))","v":""},"",""]
[]
["Composite Pay Factors"]
[null,null,null,null,"Quality Characteristic",{"$f":"LotInfo!J25","v":"#8"},{"$f":"LotInfo!O25","v":"#200"},{"$f":"LotInfo!P25","v":"B.C."},{"$f":"LotInfo!Q25","v":"%MTD"},{"$f":"LotInfo!I25","v":"#4"}]
[null,null,null,null,"Weighting Factor (wi)",{"$f":"LotInfo!J30","v":0.1},{"$f":"LotInfo!O30","v":0.15},{"$f":"LotInfo!P30","v":0.3},{"$f":"LotInfo!Q30","v":0.4},{"$f":"LotInfo!I30","v":0.05}]
[null,null,null,null,null,{"$f":"IF(F90=\"YES\",QCData!BE56,\"Not Verified\")","v":"Not Verified"},{"$f":"IF(G90=\"YES\",QCData!BF56,\"Not Verified\")","v":"Not Verified"},{"$f":"IF(H90=\"YES\",QCData!BG56,\"Not Verified\")","v":"Not Verified"},{"$f":"IF(I90=\"YES\",QCData!BH56,\"Not Verified\")","v":"Not Verified"},{"$f":"IF(J90=\"YES\",QCData!BI56,\"Not Verified\")","v":"Not Verified"}]
[]
[null,null,null,null,"Composite Factor (with density specifications)",{"$f":"ROUND(IF(OR(F95=\"Not Verified\",G95=\"Not Verified\",H95=\"Not Verified\",I95=\"Not Verified\",J95=\"Not Verified\"),\"Not Verified\",F94*F95+G94*G95+H94*H95+I94*I95+J94*J95),2)","v":{"$error":"#VALUE!"}}]
[null,null,null,null,"Composite Factor (with method compaction)",{"$f":"ROUND(IF(OR(F95=\"Not Verified\",G95=\"Not Verified\",H95=\"Not Verified\",J95=\"Not Verified\"),\"Not Verified\",F94*F95+G94*G95+H94*H95+I94*1+J94*J95),2)","v":{"$error":"#VALUE!"}}]
[]
["Payment"]
[]
[null,null,null,null,"HMA tonage constructed with density specifications",15325,null,"Payment Adustment",{"$f":"(F97-1)*F102*unitprice","v":{"$error":"#VALUE!"}}]
[null,null,null,null,"HMA tonage constructed with method compaction",700,null,"Payment Adustment",{"$f":"(F98-1)*F103*unitprice","v":{"$error":"#VALUE!"}}]
[null,null,null,null,"Total Tonage",{"$f":"SUM(F102:F103)","v":16025},null,"Total Payment Adjustment",{"$f":"SUM(I102:I103)","v":{"$error":"#VALUE!"}}]

{"sheet":"F Table","index":3,"n_rows":35,"n_cols":33,"rows_kept":35,"cut":false,"hidden":true,"merged":[[3,3,3,32],[5,1,26,1]]}
[null,"Note: to simplify using the vlookup function on the LotXPay worksheet the  table was flipped diagonally.  Typically this table has the denominator values along the left edge and the Numerator across the top."]
[]
[]
[null,null,null,"Degree of Freedom (nc-1) for Denominator"]
[null,null,null,1,2,3,4,5,6,7,8,9,10,11,12,13,14,15,16,17,18,19,20,21,22,23,24,25,26,27,28,29,30]
[null,"Degree of freedom ( (nv-1) for Numerator",1,647.79999999999995,38.51,17.440000000000001,12.22,10.01,8.81,8.07,7.57,7.21,6.94,6.72,6.55,6.41,6.3,6.2,6.12,6.04,5.98,5.92,5.87,5.83,5.79,5.75,5.72,5.69,5.66,5.63,5.61,5.59,5.57]
[null,null,2,799.5,39,16.04,10.65,8.43,7.26,6.54,6.06,5.71,5.46,5.26,5.0999999999999996,4.97,4.8600000000000003,4.7699999999999996,4.6900000000000004,4.62,4.5599999999999996,4.51,4.46,4.42,4.38,4.3499999999999996,4.32,4.29,4.2699999999999996,4.24,4.22,4.2,4.18]
[null,null,3,864.2,39.17,15.44,9.98,7.76,6.6,5.89,5.42,5.08,4.83,4.63,4.47,4.3499999999999996,4.24,4.1500000000000004,4.08,4.01,3.95,3.9,3.86,3.82,3.78,3.75,3.72,3.69,3.67,3.65,3.63,3.61,3.59]
[null,null,4,899.6,39.25,15.1,9.6,7.39,6.23,5.52,5.05,4.72,4.47,4.28,4.12,4,3.89,3.8,3.73,3.66,3.61,3.56,3.51,3.48,3.44,3.41,3.38,3.35,3.33,3.31,3.29,3.27,3.25]
[null,null,5,921.8,39.299999999999997,14.88,9.36,7.15,5.99,5.29,4.82,4.4800000000000004,4.24,4.04,3.89,3.77,3.66,3.58,3.5,3.44,3.38,3.33,3.29,3.25,3.22,3.18,3.15,3.13,3.1,3.08,3.06,3.04,3.03]
[null,null,6,937.1,39.33,14.73,9.1999999999999993,6.98,5.82,5.12,4.6500000000000004,4.32,4.07,3.88,3.73,3.6,3.5,3.41,3.34,3.28,3.22,3.17,3.13,3.09,3.05,3.02,2.99,2.97,2.94,2.92,2.9,2.88,2.87]
[null,null,7,948.2,39.36,14.62,9.07,6.85,5.7,4.99,4.53,4.2,3.95,3.76,3.61,3.48,3.38,3.29,3.22,3.16,3.1,3.05,3.01,2.97,2.93,2.9,2.87,2.85,2.82,2.8,2.78,2.76,2.75]
[null,null,8,956.7,39.369999999999997,14.54,8.98,6.76,5.6,4.9000000000000004,4.43,4.0999999999999996,3.85,3.66,3.51,3.39,3.29,3.2,3.12,3.06,3.01,2.96,2.91,2.87,2.84,2.81,2.78,2.75,2.73,2.71,2.69,2.67,2.65]
[null,null,9,963.3,39.39,14.47,8.9,6.68,5.52,4.82,4.3600000000000003,4.03,3.78,3.59,3.44,3.31,3.21,3.12,3.05,2.98,2.93,2.88,2.84,2.8,2.76,2.73,2.7,2.68,2.65,2.63,2.61,2.59,2.57]
[null,null,10,968.6,39.4,14.42,8.84,6.62,5.46,4.76,4.3,3.96,3.72,3.53,3.37,3.25,3.15,3.06,2.99,2.92,2.87,2.82,2.77,2.73,2.7,2.67,2.64,2.61,2.59,2.57,2.5499999999999998,2.5299999999999998,2.5099999999999998]
[null,null,11,{"$f":"ROUND(AVERAGE(D15,D17),3)","v":972.65},{"$f":"ROUND(AVERAGE(E15,E17),3)","v":39.405000000000001},14.38,8.7949999999999999,6.57,5.415,4.7149999999999999,4.25,3.915,3.67,3.48,3.3250000000000002,3.2,3.1,3.01,2.94,2.87,2.82,2.77,2.7250000000000001,2.6850000000000001,2.65,2.62,2.59,2.56,2.54,2.52,2.5,2.48,2.46]
[null,null,12,976.7,39.409999999999997,14.34,8.75,6.52,5.37,4.67,4.2,3.87,3.62,3.43,3.28,3.15,3.05,2.96,2.89,2.82,2.77,2.72,2.68,2.64,2.6,2.57,2.54,2.5099999999999998,2.4900000000000002,2.4700000000000002,2.4500000000000002,2.4300000000000002,2.41]
[null,null,13,{"$f":"ROUND(D17+((D20-D17)*(1/3)),3)","v":979.43299999999999},{"$f":"ROUND(E17+((E20-E17)*(1/3)),3)","v":39.417000000000002},14.31,8.7200000000000006,6.49,5.3369999999999997,4.6369999999999996,4.1669999999999998,3.8370000000000002,3.5870000000000002,3.3969999999999998,3.2469999999999999,3.117,3.0169999999999999,2.927,2.8570000000000002,2.7869999999999999,2.7370000000000001,2.6869999999999998,2.6429999999999998,2.6030000000000002,2.5670000000000002,2.5369999999999999,2.5070000000000001,2.4769999999999999,2.4569999999999999,2.4329999999999998,2.4129999999999998,2.3929999999999998,2.3769999999999998]
[null,null,14,{"$f":"ROUND(D20-((D20-D17)*(1/3)),3)","v":982.16700000000003},{"$f":"ROUND(E20-((E20-E17)*(1/3)),3)","v":39.423000000000002},14.28,8.69,6.46,5.3029999999999999,4.6029999999999998,4.133,3.8029999999999999,3.5529999999999999,3.363,3.2130000000000001,3.0830000000000002,2.9830000000000001,2.8929999999999998,2.823,2.7530000000000001,2.7029999999999998,2.653,2.6070000000000002,2.5670000000000002,2.5329999999999999,2.5030000000000001,2.4729999999999999,2.4430000000000001,2.423,2.3969999999999998,2.3769999999999998,2.3570000000000002,2.343]
[null,null,15,984.9,39.43,14.25,8.66,6.43,5.27,4.57,4.0999999999999996,3.77,3.52,3.33,3.18,3.05,2.95,2.86,2.79,2.72,2.67,2.62,2.57,2.5299999999999998,2.5,2.4700000000000002,2.44,2.41,2.39,2.36,2.34,2.3199999999999998,2.31]
[null,null,16,{"$f":"ROUND(D$20+((1/5)*(D$25-D$20)),3)","v":986.54},{"$f":"ROUND(E$20+((1/5)*(E$25-E$20)),3)","v":39.433999999999997},14.234,8.64,6.41,5.25,4.55,4.08,3.75,3.5,3.31,3.1579999999999999,3.03,2.9279999999999999,2.84,2.7679999999999998,2.7,2.6480000000000001,2.5979999999999999,2.548,2.508,2.4780000000000002,2.448,2.4180000000000001,2.3879999999999999,2.3679999999999999,2.3380000000000001,2.3180000000000001,2.298,2.2879999999999998]
[null,null,17,{"$f":"ROUND(D$20+((2/5)*(D$25-D$20)),3)","v":988.18},{"$f":"ROUND(E$20+((2/5)*(E$25-E$20)),3)","v":39.438000000000002},14.218,8.6199999999999992,6.39,5.23,4.53,4.0599999999999996,3.73,3.48,3.29,3.1360000000000001,3.01,2.9060000000000001,2.82,2.746,2.68,2.6259999999999999,2.5760000000000001,2.5259999999999998,2.4860000000000002,2.456,2.4260000000000002,2.3959999999999999,2.3660000000000001,2.3460000000000001,2.3159999999999998,2.2959999999999998,2.2759999999999998,2.266]
[null,null,18,{"$f":"ROUND(D$20+((3/5)*(D$25-D$20)),3)","v":989.82},{"$f":"ROUND(E$20+((3/5)*(E$25-E$20)),3)","v":39.442},14.202,8.6,6.37,5.21,4.51,4.04,3.71,3.46,3.27,3.1139999999999999,2.99,2.8839999999999999,2.8,2.7240000000000002,2.66,2.6040000000000001,2.5539999999999998,2.504,2.464,2.4340000000000002,2.4039999999999999,2.3740000000000001,2.3439999999999999,2.3239999999999998,2.294,2.274,2.254,2.2440000000000002]
[null,null,19,{"$f":"ROUND(D$20+((4/5)*(D$25-D$20)),3)","v":991.46},{"$f":"ROUND(E$20+((4/5)*(E$25-E$20)),3)","v":39.445999999999998},14.186,8.58,6.35,5.19,4.49,4.0199999999999996,3.69,3.44,3.25,3.0920000000000001,2.97,2.8620000000000001,2.78,2.702,2.64,2.5819999999999999,2.532,2.4820000000000002,2.4420000000000002,2.4119999999999999,2.3820000000000001,2.3519999999999999,2.3220000000000001,2.302,2.2719999999999998,2.2519999999999998,2.2320000000000002,2.222]
[null,null,20,993.1,39.450000000000003,14.17,8.56,6.33,5.17,4.47,4,3.67,3.42,3.23,3.07,2.95,2.84,2.76,2.68,2.62,2.56,2.5099999999999998,2.46,2.42,2.39,2.36,2.33,2.2999999999999998,2.2799999999999998,2.25,2.23,2.21,2.2000000000000002]
[null,null,24,997.2,39.46,14.12,8.51,6.28,5.12,4.42,3.95,3.61,3.37,3.17,3.02,2.89,2.79,2.7,2.63,2.56,2.5,2.4500000000000002,2.41,2.37,2.33,2.2999999999999998,2.27,2.2400000000000002,2.2200000000000002,2.19,2.17,2.15,2.14]
[null,null,30,1001,39.46,14.08,8.4600000000000009,6.23,5.07,4.3600000000000003,3.89,3.56,3.31,3.12,2.96,2.84,2.73,2.64,2.57,2.5,2.44,2.39,2.35,2.31,2.27,2.2400000000000002,2.21,2.1800000000000002,2.16,2.13,2.11,2.09,2.0699999999999998]
[]
[]
[]
[null,null,"Level of Confidence 0.025  (aka alpha, α)"]
[]
[]
[]
[null,null,"The green cells above indicate values that were developed using a straightline interpolation.  Before taking this step, plots of the other values were reviewed and determined that a straightline interpretation was appropriate."]

{"sheet":"TCrit","index":4,"n_rows":40,"n_cols":2,"rows_kept":40,"cut":false,"hidden":true,"merged":[]}
["Table 39-5 - CRITICAL t-VALUE FOR VERIFICATION OF QUALITY CONTROL TESTING"]
[]
[]
["(for  = 0.025)"]
["(nc+nv-2)","tcrit"]
[]
[1,24.452000000000002]
[2,6.2050000000000001]
[3,4.1769999999999996]
[4,3.4950000000000001]
[5,3.1629999999999998]
[6,2.9689999999999999]
[7,2.8410000000000002]
[8,2.7519999999999998]
[9,2.6850000000000001]
[10,2.6339999999999999]
[11,2.593]
[12,2.56]
[13,2.5329999999999999]
[14,2.5099999999999998]
[15,2.4900000000000002]
[16,2.4729999999999999]
[17,2.4580000000000002]
[18,2.4449999999999998]
[19,2.4329999999999998]
[20,2.423]
[21,2.4140000000000001]
[22,2.4049999999999998]
[23,2.3980000000000001]
[24,2.391]
[25,2.3849999999999998]
[26,2.379]
[27,2.3730000000000002]
[28,2.3679999999999999]
[29,2.3639999999999999]
[30,2.36]
[40,2.3290000000000002]
[60,2.2989999999999999]
[120,2.27]
["∞",2.2410000000000001]

{"sheet":"Imported QCData","index":5,"n_rows":129,"n_cols":130,"rows_kept":129,"cut":false,"hidden":true,"merged":[]}
["QCData"]
[]
[]
[]
[]
[]
[]
[]
[]
[]
[]
[]
[]
[]
[]
[]
[]
[]
[null,null,null,null,null,"JMF Target Value",{"$f":"IF(LotInfo!C26=\"\",\"\",LotInfo!C26)","v":""},{"$f":"IF(LotInfo!D26=\"\",\"\",LotInfo!D26)","v":""},{"$f":"IF(LotInfo!E26=\"\",\"\",LotInfo!E26)","v":""},{"$f":"IF(LotInfo!F26=\"\",\"\",LotInfo!F26)","v":""},{"$f":"IF(LotInfo!G26=\"\",\"\",LotInfo!G26)","v":""},{"$f":"IF(LotInfo!H26=\"\",\"\",LotInfo!H26)","v":""},{"$f":"IF(LotInfo!I26=\"\",\"\",LotInfo!I26)","v":""},{"$f":"IF(LotInfo!J26=\"\",\"\",LotInfo!J26)","v":""},{"$f":"IF(LotInfo!K26=\"\",\"\",LotInfo!K26)","v":""},{"$f":"IF(LotInfo!L26=\"\",\"\",LotInfo!L26)","v":""},{"$f":"IF(LotInfo!M26=\"\",\"\",LotInfo!M26)","v":""},{"$f":"IF(LotInfo!N26=\"\",\"\",LotInfo!N26)","v":""},{"$f":"IF(LotInfo!O26=\"\",\"\",LotInfo!O26)","v":""},{"$f":"IF(LotInfo!P26=\"\",\"\",LotInfo!P26)","v":""},{"$f":"IF(LotInfo!Q26=\"\",\"\",LotInfo!Q26)","v":""},{"$f":"IF(LotInfo!R26=\"\",\"\",LotInfo!R26)","v":""}]
[]
[null,null,null,null,null,"Upper Spec Limit",{"$f":"LotInfo!C28","v":""},{"$f":"LotInfo!D28","v":""},{"$f":"LotInfo!E28","v":""},{"$f":"LotInfo!F28","v":""},{"$f":"LotInfo!G28","v":""},{"$f":"LotInfo!H28","v":""},{"$f":"LotInfo!I28","v":""},{"$f":"LotInfo!J28","v":""},{"$f":"LotInfo!K28","v":""},{"$f":"LotInfo!L28","v":""},{"$f":"LotInfo!M28","v":""},{"$f":"LotInfo!N28","v":""},{"$f":"LotInfo!O28","v":""},{"$f":"LotInfo!P28","v":""},{"$f":"LotInfo!Q28","v":100},{"$f":"LotInfo!R28","v":""}]
[null,null,null,null,null,"Lower Spec Limit",{"$f":"LotInfo!C29","v":""},{"$f":"LotInfo!D29","v":""},{"$f":"LotInfo!E29","v":""},{"$f":"LotInfo!F29","v":""},{"$f":"LotInfo!G29","v":""},{"$f":"LotInfo!H29","v":""},{"$f":"LotInfo!I29","v":""},{"$f":"LotInfo!J29","v":""},{"$f":"LotInfo!K29","v":""},{"$f":"LotInfo!L29","v":""},{"$f":"LotInfo!M29","v":""},{"$f":"LotInfo!N29","v":""},{"$f":"LotInfo!O29","v":""},{"$f":"LotInfo!P29","v":""},{"$f":"LotInfo!Q29","v":97},{"$f":"LotInfo!R29","v":""}]
[]
[]
[null,null,null,null,null,"Quality Characteristic","2\"","1-1/2\"","1\"","3/4\"","1/2\"","3/8\"","#4","#8","#16","#30","#50","#100","#200","B.C.","%MTD","%Air Voids"]
["TEST NO.","Date","Contractor's Est","Lot No.","Sublot No","3 Out"]
[null,null,"of SubLot Quantity",null,null,"in 1 Day?"]
[null,null,"(tons)",null,null,"Yes or NO"]
[]
[null,"2008-09-11","",1,1,null,null,null,null,89,null,null,null,40,null,null,null,null,3,5.8,95,4.2,null,null,null,null,null,null,null,null,null,null,null,null,null,null,null,null,null,null,null,null,null,null,null,null,null,null,null,null,null,null,null,null,null,null,null,null,null,null,null,null,null,null,null,null,null,null,null,null,null,null,null,null,null,null,null,null,null,null,null,null,null,null,null,null,null,null,null,null,null,null,null,null,null,null,null,null,null,null,null,null,null,null,"x2","2008-09-11",null,1,1,"YES",null,null,null,95,null,65,null,40,29,11,null,null,3,5.8,95.2,95.2,97,3.9,4,4.0999999999999996]
[null,"","",1,2,null,null,null,null,89,null,null,null,40,null,null,null,null,4.9000000000000004,5.8,94.4,2.4,null,null,null,null,null,null,null,null,null,null,null,null,null,null,null,null,null,null,null,null,null,null,null,null,null,null,null,null,null,null,null,null,null,null,null,null,null,null,null,null,null,null,null,null,null,null,null,null,null,null,null,null,null,null,null,null,null,null,null,null,null,null,null,null,null,null,null,null,null,null,null,null,null,null,null,null,null,null,null,null,null,null,null,null,null,1,2,"NO",null,null,null,94,null,66,null,40,23,12,null,null,4.9000000000000004,5.8,94.2,96,97]
[null,"","",1,3,null,null,null,null,89,null,null,null,40,null,null,null,null,3,5.0999999999999996,99,3.9,null,null,null,null,null,null,null,null,null,null,null,null,null,null,null,null,null,null,null,null,null,null,null,null,null,null,null,null,null,null,null,null,null,null,null,null,null,null,null,null,null,null,null,null,null,null,null,null,null,null,null,null,null,null,null,null,null,null,null,null,null,null,null,null,null,null,null,null,null,null,null,null,null,null,null,null,null,null,null,null,null,null,null,null,null,1,3,"YES",null,null,null,93,null,67,null,40,55,13,null,null,3,5.0999999999999996,97,95,91.5,3.5,3.5,3.6]
[null,"","",1,4,"",null,null,null,null,null,null,null,40,null,null,null,null,5.0999999999999996,5.4,93,4,null,null,null,null,null,null,null,null,null,null,null,null,null,null,null,null,null,null,null,null,null,null,null,null,null,null,null,null,null,null,null,null,null,null,null,null,null,null,null,null,null,null,null,null,null,null,null,null,null,null,null,null,null,null,null,null,null,null,null,null,null,null,null,null,null,null,null,null,null,null,null,null,null,null,null,null,null,null,null,null,null,null,3,null,null,1,4,"YES",null,null,null,92,null,68,null,40,92,14,null,null,5.0999999999999996,5.4,92.3,95.2,95.2]
[null,"2008-11-12","",1,5,"",null,null,null,null,null,null,null,91,null,null,null,null,4.8,5.2,95.4,3.5,null,null,null,null,null,null,null,null,null,null,null,null,null,null,null,null,null,null,null,null,null,null,null,null,null,null,null,null,null,null,null,null,null,null,null,null,null,null,null,null,null,null,null,null,null,null,null,null,null,null,null,null,null,null,null,null,null,null,null,null,null,null,null,null,null,null,null,null,null,null,null,null,null,null,null,null,null,null,null,null,null,null,null,"2008-11-12",null,1,5,null,null,null,null,91,null,69,null,33,22,15,null,null,4.8,5.2,93.1,93.2,93.3,3.6,3.7,3.8]
[null,"2009-07-16","",1,6,"",null,null,null,89,null,null,null,40,null,null,null,null,6.8,5.09,93.4,4.2,null,null,null,null,null,null,null,null,null,null,null,null,null,null,null,null,null,null,null,null,null,null,null,null,null,null,null,null,null,null,null,null,null,null,null,null,null,null,null,null,null,null,null,null,null,null,null,null,null,null,null,null,null,null,null,null,null,null,null,null,null,null,null,null,null,null,null,null,null,null,null,null,null,null,null,null,null,null,null,null,null,null,null,"2009-07-16",null,1,6,"YES",null,null,null,90,null,70,null,40,null,16,null,null,6.8,5.09,95.1,95.2,95.2]
[null,"","",1,7,"",null,null,null,89,null,null,null,40,null,null,null,null,5.8,5.04,95,4.3,null,null,null,null,null,null,null,null,null,null,null,null,null,null,null,null,null,null,null,null,null,null,null,null,null,null,null,null,null,null,null,null,null,null,null,null,null,null,null,null,null,null,null,null,null,null,null,null,null,null,null,null,null,null,null,null,null,null,null,null,null,null,null,null,null,null,null,null,null,null,null,null,null,null,null,null,null,null,null,null,null,null,null,null,null,1,7,"NO",null,null,null,89,null,71,null,40,null,17,null,null,5.8,5.04,94.1,94.2,94.1,4.0999999999999996,4.2,4.3]
[null,"","",1,8,null,null,null,null,null,null,null,null,40,null,null,null,null,4.9000000000000004,4.9800000000000004,94.4,2.6,null,null,null,null,null,null,null,null,null,null,null,null,null,null,null,null,null,null,null,null,null,null,null,null,null,null,null,null,null,null,null,null,null,null,null,null,null,null,null,null,null,null,null,null,null,null,null,null,null,null,null,null,null,null,null,null,null,null,null,null,null,null,null,null,null,null,null,null,null,null,null,null,null,null,null,null,null,null,null,null,null,null,null,null,null,1,8,null,null,null,null,88,null,92,null,40,null,18,null,null,4.9000000000000004,4.9800000000000004,92.5,92.3,92.4]
[null,"2009-07-17","",1,9,"",null,null,null,null,null,null,null,40,null,null,null,null,10,5.0999999999999996,94,4,null,null,null,null,null,null,null,null,null,null,null,null,null,null,null,null,null,null,null,null,null,null,null,null,null,null,null,null,null,null,null,null,null,null,null,null,null,null,null,null,null,null,null,null,null,null,null,null,null,null,null,null,null,null,null,null,null,null,null,null,null,null,null,null,null,null,null,null,null,null,null,null,null,null,null,null,null,null,null,null,null,null,null,"2009-07-17",null,1,9,"YES",null,null,null,91,null,93,null,40,null,19,null,null,10,5.0999999999999996,90.1,90.2,90.3,4,4,4]
[null,"","",1,10,"",null,null,null,null,null,null,null,41,null,null,null,null,8,5.19,93,3.9,null,null,null,null,null,null,null,null,null,null,null,null,null,null,null,null,null,null,null,null,null,null,null,null,null,null,null,null,null,null,null,null,null,null,null,null,null,null,null,null,null,null,null,null,null,null,null,null,null,null,null,null,null,null,null,null,null,null,null,null,null,null,null,null,null,null,null,null,null,null,null,null,null,null,null,null,null,null,null,null,null,null,null,null,null,1,10,null,null,null,null,88,null,null,null,41,null,20,null,null,8,5.19,90.4,93.3,95.2]
[null,"","",1,11,"",null,null,null,null,null,null,null,41,null,null,null,null,9,5.0999999999999996,95.4,3,null,null,null,null,null,null,null,null,null,null,null,null,null,null,null,null,null,null,null,null,null,null,null,null,null,null,null,null,null,null,null,null,null,null,null,null,null,null,null,null,null,null,null,null,null,null,null,null,null,null,null,null,null,null,null,null,null,null,null,null,null,null,null,null,null,null,null,null,null,null,null,null,null,null,null,null,null,null,null,null,null,null,null,null,null,1,11,null,null,null,null,87,null,null,null,41,null,21,null,null,9,5.0999999999999996,90.5,90.1,90.2,4.2,4.3,4.4000000000000004]
[null,"","",1,12,"",null,null,null,null,null,null,null,38,null,null,null,null,10,5.2,93.4,5.2,null,null,null,null,null,null,null,null,null,null,null,null,null,null,null,null,null,null,null,null,null,null,null,null,null,null,null,null,null,null,null,null,null,null,null,null,null,null,null,null,null,null,null,null,null,null,null,null,null,null,null,null,null,null,null,null,null,null,null,null,null,null,null,null,null,null,null,null,null,null,null,null,null,null,null,null,null,null,null,null,null,null,"G3",null,null,1,12,null,null,null,null,90,null,null,null,38,null,20,null,null,10,5.2,89.1,89.2,89.3]
[null,"2009-07-20","",1,13,"",null,null,null,null,null,null,null,33,null,null,null,null,5.4,5.14,95,3.9,null,null,null,null,null,null,null,null,null,null,null,null,null,null,null,null,null,null,null,null,null,null,null,null,null,null,null,null,null,null,null,null,null,null,null,null,null,null,null,null,null,null,null,null,null,null,null,null,null,null,null,null,null,null,null,null,null,null,null,null,null,null,null,null,null,null,null,null,null,null,null,null,null,null,null,null,null,null,null,null,null,null,null,"2009-07-20",null,1,13,null,null,null,null,91,null,94,null,33,null,19,null,null,5.4,5.14,93.2,92.5,94.6,3.8,3.9,4]
[null,"","",1,14,"",null,null,null,null,null,null,null,33,null,null,null,null,5.8,4.9000000000000004,94.4,4.2,null,null,null,null,null,null,null,null,null,null,null,null,null,null,null,null,null,null,null,null,null,null,null,null,null,null,null,null,null,null,null,null,null,null,null,null,null,null,null,null,null,null,null,null,null,null,null,null,null,null,null,null,null,null,null,null,null,null,null,null,null,null,null,null,null,null,null,null,null,null,null,null,null,null,null,null,null,null,null,null,null,null,null,null,null,1,14,null,null,null,null,null,null,null,null,33,null,18,null,null,5.8,4.9000000000000004,91.2,96.2,95.2]
[null,"2009-07-24","",1,15,"",null,null,null,null,null,null,null,39,null,null,null,null,4.9000000000000004,5.24,94,4.3,null,null,null,null,null,null,null,null,null,null,null,null,null,null,null,null,null,null,null,null,null,null,null,null,null,null,null,null,null,null,null,null,null,null,null,null,null,null,null,null,null,null,null,null,null,null,null,null,null,null,null,null,null,null,null,null,null,null,null,null,null,null,null,null,null,null,null,null,null,null,null,null,null,null,null,null,null,null,null,null,null,null,null,"2009-07-24",null,1,15,null,null,null,null,null,null,null,null,39,null,17,null,null,4.9000000000000004,5.24,95.2,91.6,93.1,4.5,4.5999999999999996,4.7]
[null,"2009-08-23","",1,16,"",null,null,null,null,null,null,null,38,null,null,null,null,6.8,4.91,93,4.2,null,null,null,null,null,null,null,null,null,null,null,null,null,null,null,null,null,null,null,null,null,null,null,null,null,null,null,null,null,null,null,null,null,null,null,null,null,null,null,null,null,null,null,null,null,null,null,null,null,null,null,null,null,null,null,null,null,null,null,null,null,null,null,null,null,null,null,null,null,null,null,null,null,null,null,null,null,null,null,null,null,null,null,"2009-08-23",null,1,16,null,null,null,null,null,null,null,null,38,null,16,null,null,6.8,4.91,94.4,95.6,95.1]
[null,"","",1,17,"",null,null,null,null,null,null,null,36,null,null,null,null,6.5,5.05,95.4,4.3,null,null,null,null,null,null,null,null,null,null,null,null,null,null,null,null,null,null,null,null,null,null,null,null,null,null,null,null,null,null,null,null,null,null,null,null,null,null,null,null,null,null,null,null,null,null,null,null,null,null,null,null,null,null,null,null,null,null,null,null,null,null,null,null,null,null,null,null,null,null,null,null,null,null,null,null,null,null,null,null,null,null,null,null,null,1,17,null,null,null,null,null,null,null,null,36,null,15,null,null,6.5,5.05,96.3,96.2,91.7,3.2,3.3,3.4]
[null,"","",1,18,"",null,null,null,null,null,null,null,37,null,null,null,null,6.6,5.03,93.4,3.9,null,null,null,null,null,null,null,null,null,null,null,null,null,null,null,null,null,null,null,null,null,null,null,null,null,null,null,null,null,null,null,null,null,null,null,null,null,null,null,null,null,null,null,null,null,null,null,null,null,null,null,null,null,null,null,null,null,null,null,null,null,null,null,null,null,null,null,null,null,null,null,null,null,null,null,null,null,null,null,null,null,null,null,null,null,1,18,null,null,null,null,null,null,null,null,37,null,14,null,null,6.6,5.03,91.5,92.5,92.9]
[null,"2009-08-30","",1,19,"",null,null,null,null,null,null,null,38,null,null,null,null,7,5.15,"",4,null,null,null,null,null,null,null,null,null,null,null,null,null,null,null,null,null,null,null,null,null,null,null,null,null,null,null,null,null,null,null,null,null,null,null,null,null,null,null,null,null,null,null,null,null,null,null,null,null,null,null,null,null,null,null,null,null,null,null,null,null,null,null,null,null,null,null,null,null,null,null,null,null,null,null,null,null,null,null,null,null,null,null,"2009-08-30",null,1,19,"YES",null,null,null,null,null,null,null,38,null,13,null,null,7,5.15,92.5,93.5,93.7,1.5,1.6,1.7]
[null,"","",1,20,"",null,null,null,null,null,null,null,32,null,null,null,null,5.2,5.0999999999999996,"",3.9,null,null,null,null,null,null,null,null,null,null,null,null,null,null,null,null,null,null,null,null,null,null,null,null,null,null,null,null,null,null,null,null,null,null,null,null,null,null,null,null,null,null,null,null,null,null,null,null,null,null,null,null,null,null,null,null,null,null,null,null,null,null,null,null,null,null,null,null,null,null,null,null,null,null,null,null,null,null,null,null,null,null,null,null,null,1,20,null,null,null,null,null,null,null,null,32,null,12,null,null,5.2,5.0999999999999996,91.5,94.2,92.2]
[null,"","",1,21,"",null,null,null,null,null,null,null,41,null,null,null,null,7.3,5.32,"",4.2,null,null,null,null,null,null,null,null,null,null,null,null,null,null,null,null,null,null,null,null,null,null,null,null,null,null,null,null,null,null,null,null,null,null,null,null,null,null,null,null,null,null,null,null,null,null,null,null,null,null,null,null,null,null,null,null,null,null,null,null,null,null,null,null,null,null,null,null,null,null,null,null,null,null,null,null,null,null,null,null,null,null,null,null,null,1,21,null,null,null,null,null,null,null,null,41,null,10,null,null,7.3,5.32,92.3,92.8,94.2,2.2000000000000002,2.2999999999999998,2.4]
[null,"","",1,22,"",null,null,null,null,null,null,null,37,null,null,null,null,6.5,4.5999999999999996,"",4.3,null,null,null,null,null,null,null,null,null,null,null,null,null,null,null,null,null,null,null,null,null,null,null,null,null,null,null,null,null,null,null,null,null,null,null,null,null,null,null,null,null,null,null,null,null,null,null,null,null,null,null,null,null,null,null,null,null,null,null,null,null,null,null,null,null,null,null,null,null,null,null,null,null,null,null,null,null,null,null,null,null,null,null,null,null,1,22,"NO",null,null,null,null,null,null,null,37,null,9,null,null,6.5,4.5999999999999996,93.3,92.1,95.1]
[null,"2009-09-18","",1,23,"",null,null,null,null,null,null,null,35,null,null,null,null,6.2,4.72,95,3.9,null,null,null,null,null,null,null,null,null,null,null,null,null,null,null,null,null,null,null,null,null,null,null,null,null,null,null,null,null,null,null,null,null,null,null,null,null,null,null,null,null,null,null,null,null,null,null,null,null,null,null,null,null,null,null,null,null,null,null,null,null,null,null,null,null,null,null,null,null,null,null,null,null,null,null,null,null,null,null,null,null,null,null,"2009-09-18",null,1,23,null,null,null,null,null,null,null,null,35,null,8,null,null,6.2,4.72,93.5,92.3,92.7,2,2.1,2.2000000000000002]
[null,"2009-09-18","",1,24,null,null,null,null,null,null,null,null,37,null,null,null,null,6.6,5.01,94.4,4,null,null,null,null,null,null,null,null,null,null,null,null,null,null,null,null,null,null,null,null,null,null,null,null,null,null,null,null,null,null,null,null,null,null,null,null,null,null,null,null,null,null,null,null,null,null,null,null,null,null,null,null,null,null,null,null,null,null,null,null,null,null,null,null,null,null,null,null,null,null,null,null,null,null,null,null,null,null,null,null,null,null,null,"2009-09-18",null,1,24,null,null,null,null,null,null,null,null,37,null,9,null,null,6.6,5.01,91.1,91.1,91.1]
[null,"2009-09-18","",1,25,"",null,null,null,null,null,null,null,33,null,null,null,null,5.9,5.19,94,3.9,null,null,null,null,null,null,null,null,null,null,null,null,null,null,null,null,null,null,null,null,null,null,null,null,null,null,null,null,null,null,null,null,null,null,null,null,null,null,null,null,null,null,null,null,null,null,null,null,null,null,null,null,null,null,null,null,null,null,null,null,null,null,null,null,null,null,null,null,null,null,null,null,null,null,null,null,null,null,null,null,null,null,null,"2009-09-18",null,1,25,null,null,null,null,null,null,null,null,33,null,10,null,null,5.9,5.19,92.2,91.5,93.4,1,1.1000000000000001,1.2]
[null,"2009-09-18","",1,26,"",null,null,null,null,null,null,null,40,null,null,null,null,7.8,5.16,93,3.9,null,null,null,null,null,null,null,null,null,null,null,null,null,null,null,null,null,null,null,null,null,null,null,null,null,null,null,null,null,null,null,null,null,null,null,null,null,null,null,null,null,null,null,null,null,null,null,null,null,null,null,null,null,null,null,null,null,null,null,null,null,null,null,null,null,null,null,null,null,null,null,null,null,null,null,null,null,null,null,null,null,null,null,"2009-09-18",null,1,26,null,null,null,null,null,null,null,null,40,null,11,null,null,7.8,5.16,92.1,92.3,92.2]
[null,"2009-09-19","",1,27,"",null,null,null,null,null,null,null,36,null,null,null,null,6.9,4.97,95.4,4,null,null,null,null,null,null,null,null,null,null,null,null,null,null,null,null,null,null,null,null,null,null,null,null,null,null,null,null,null,null,null,null,null,null,null,null,null,null,null,null,null,null,null,null,null,null,null,null,null,null,null,null,null,null,null,null,null,null,null,null,null,null,null,null,null,null,null,null,null,null,null,null,null,null,null,null,null,null,null,null,null,null,null,"2009-09-19",null,1,27,null,null,null,null,null,null,null,null,36,null,12,null,null,6.9,4.97,90.1,91.2,91.3,0.9,0.8,0.7]
[null,null,null,null,null,null,null,{"$f":"IF(AP57=\"\",\"\",AP57)","v":""},{"$f":"IF(AQ57=\"\",\"\",AQ57)","v":""},{"$f":"IF(AR57=\"\",\"\",AR57)","v":""},{"$f":"IF(AS57=\"\",\"\",AS57)","v":""},{"$f":"IF(AT57=\"\",\"\",AT57)","v":""},{"$f":"IF(AU57=\"\",\"\",AU57)","v":""},{"$f":"IF(AV57=\"\",\"\",AV57)","v":""},{"$f":"IF(AW57=\"\",\"\",AW57)","v":""},{"$f":"IF(AX57=\"\",\"\",AX57)","v":""},{"$f":"IF(AY57=\"\",\"\",AY57)","v":""},{"$f":"IF(AZ57=\"\",\"\",AZ57)","v":""},{"$f":"IF(BA57=\"\",\"\",BA57)","v":""},{"$f":"IF(BB57=\"\",\"\",BB57)","v":""},{"$f":"IF(BC57=\"\",\"\",BC57)","v":""},{"$f":"IF(BD57=\"\",\"\",BD57)","v":""}]
[null,null,null,null,null,null,null,"","","","","","","","","","","","","","",""]
[null,null,null,null,null,null,null,"","","","","","","","","","","","","","",""]
[null,null,null,null,null,null,null,"","","","","","","","","","","","","","",""]
[null,null,null,null,null,null,null,"","","","","","","","","","","","","","",""]
[null,null,null,null,null,null,null,"","","","","","","","","","","","","","",""]
[null,null,null,null,null,null,null,"","","","","","","","","","","","","","",""]
[null,null,null,null,null,null,null,"","","","","","","","","","","","","","",""]
[null,null,null,null,null,null,null,"","","","","","","","","","","","","","",""]
[null,null,null,null,null,null,null,"","","","","","","","","","","","","","",""]
[null,null,null,null,null,null,null,"","","","","","","","","","","","","","",""]
[null,null,null,null,null,null,null,"","","","","","","","","","","","","","",""]
[null,null,null,null,null,null,null,"","","","","","","","","","","","","","",""]
[null,null,null,null,null,null,null,"","","","","","","","","","","","","","",""]
[null,null,null,null,null,null,null,"","","","","","","","","","","","","","",""]
[null,null,null,null,null,null,null,"","","","","","","","","","","","","","",""]
[null,null,null,null,null,null,null,"","","","","","","","","","","","","","",""]
[null,null,null,null,null,null,null,"","","","","","","","","","","","","","",""]
[null,null,null,null,null,null,null,"","","","","","","","","","","","","","",""]
[null,null,null,null,null,null,null,"","","","","","","","","","","","","","",""]
[null,null,null,null,null,null,null,"","","","","","","","","","","","","","",""]
[null,null,null,null,null,null,null,"","","","","","","","","","","","","","",""]
[null,null,null,null,null,null,null,"","","","","","","","","","","","","","",""]
[null,null,null,null,null,null,null,"","","","","","","","","","","","","","",""]
[null,null,null,null,null,null,null,"","","","","","","","","","","","","","",""]
[null,null,null,null,null,null,null,"","","","","","","","","","","","","","",""]
[null,null,null,null,null,null,null,"","","","","","","","","","","","","","",""]
[null,null,null,null,null,null,null,"","","","","","","","","","","","","","",""]
[null,null,null,null,null,null,null,"","","","","","","","","","","","","","",""]
[null,null,null,null,null,null,null,"","","","","","","","","","","","","","",""]
[null,null,null,null,null,null,null,"","","","","","","","","","","","","","",""]
[null,null,null,null,null,null,null,"","","","","","","","","","","","","","",""]
[null,null,null,null,null,null,null,"","","","","","","","","","","","","","",""]
[null,null,null,null,null,null,null,"","","","","","","","","","","","","","",""]
[null,null,null,null,null,null,null,"","","","","","","","","","","","","","",""]
[null,null,null,null,null,null,null,"","","","","","","","","","","","","","",""]
[null,null,null,null,null,null,null,"","","","","","","","","","","","","","",""]
[null,null,null,null,null,null,null,"","","","","","","","","","","","","","",""]
[null,null,null,null,null,null,null,{"$f":"IF(AP95=\"\",\"\",AP95)","v":""},{"$f":"IF(AQ95=\"\",\"\",AQ95)","v":""},{"$f":"IF(AR95=\"\",\"\",AR95)","v":""},{"$f":"IF(AS95=\"\",\"\",AS95)","v":""},{"$f":"IF(AT95=\"\",\"\",AT95)","v":""},{"$f":"IF(AU95=\"\",\"\",AU95)","v":""},{"$f":"IF(AV95=\"\",\"\",AV95)","v":""},{"$f":"IF(AW95=\"\",\"\",AW95)","v":""},{"$f":"IF(AX95=\"\",\"\",AX95)","v":""},{"$f":"IF(AY95=\"\",\"\",AY95)","v":""},{"$f":"IF(AZ95=\"\",\"\",AZ95)","v":""},{"$f":"IF(BA95=\"\",\"\",BA95)","v":""},{"$f":"IF(BB95=\"\",\"\",BB95)","v":""},{"$f":"IF(BC95=\"\",\"\",BC95)","v":""},{"$f":"IF(BD95=\"\",\"\",BD95)","v":""}]
[null,null,null,null,null,null,null,"","","","","","","","","","","","","","",""]
[null,null,null,null,null,null,null,"","","","","","","","","","","","","","",""]
[null,null,null,null,null,null,null,"","","","","","","","","","","","","","",""]
[null,null,null,null,null,null,null,"","","","","","","","","","","","","","",""]
[null,null,null,null,null,null,null,"","","","","","","","","","","","","","",""]
[null,null,null,null,null,null,null,"","","","","","","","","","","","","","",""]
[null,null,null,null,null,null,null,"","","","","","","","","","","","","","",""]
[null,null,null,null,null,null,null,"","","","","","","","","","","","","","",""]
[null,null,null,null,null,null,null,"","","","","","","","","","","","","","",""]
[null,null,null,null,null,null,null,"","","","","","","","","","","","","","",""]
[null,null,null,null,null,null,null,"","","","","","","","","","","","","","",""]
[null,null,null,null,null,null,null,"","","","","","","","","","","","","","",""]
[null,null,null,null,null,null,null,"","","","","","","","","","","","","","",""]
[null,null,null,null,null,null,null,"","","","","","","","","","","","","","",""]
[null,null,null,null,null,null,null,"","","","","","","","","","","","","","",""]
[null,null,null,null,null,null,null,"","","","","","","","","","","","","","",""]
[null,null,null,null,null,null,null,"","","","","","","","","","","","","","",""]
[null,null,null,null,null,null,null,"","","","","","","","","","","","","","",""]
[null,null,null,null,null,null,null,"","","","","","","","","","","","","","",""]
[null,null,null,null,null,null,null,"","","","","","","","","","","","","","",""]
[null,null,null,null,null,null,null,"","","","","","","","","","","","","","",""]
[null,null,null,null,null,null,null,"","","","","","","","","","","","","","",""]
[null,null,null,null,null,null,null,"","","","","","","","","","","","","","",""]
[null,null,null,null,null,null,null,"","","","","","","","","","","","","","",""]
[null,null,null,null,null,null,null,"","","","","","","","","","","","","","",""]
[null,null,null,null,null,null,null,"","","","","","","","","","","","","","",""]
[null,null,null,null,null,null,null,"","","","","","","","","","","","","","",""]
[null,null,null,null,null,null,null,"","","","","","","","","","","","","","",""]
[null,null,null,null,null,null,null,"","","","","","","","","","","","","","",""]
[null,null,null,null,null,null,null,"","","","","","","","","","","","","","",""]
[null,null,null,null,null,null,null,"","","","","","","","","","","","","","",""]
[null,null,null,null,null,null,null,"","","","","","","","","","","","","","",""]
[null,null,null,null,null,null,null,"","","","","","","","","","","","","","",""]
[null,null,null,null,null,null,null,"","","","","","","","","","","","","","",""]

{"sheet":"Beta PWL Calculation","index":6,"n_rows":52,"n_cols":16,"rows_kept":52,"cut":false,"hidden":true,"merged":[[0,0,0,9],[21,0,21,15]]}
["1-Sided Beta PWL calculation"]
["Sublot","Test Result","Lot Averge","Lot Standard Deviation","Quality Index (Q)","Number Tests in Lot","d2","x","PWL","LSL"]
["1A1",3850]
["1A2"]
["1B1"]
["1B2"]
["1C1"]
["1C2"]
["1D1"]
["1D2"]
["1E1"]
["1E2",null,{"$f":"AVERAGE(B3:B12)","v":3850},{"$f":"IF(STDEV(B3:B12)<0.001,0.001,STDEV(B3:B12))","v":{"$error":"#DIV/0!"}},{"$f":"(C12-J12)/D12","v":{"$error":"#DIV/0!"}},{"$f":"COUNT(B3:B12)","v":1},{"$f":"SQRT(F12)","v":1},{"$f":"IF(MAX(0,0.5-(E12*G12/(2*(F12-1))))>1,1,MAX(0,0.5-(E12*G12/(2*(F12-1)))))","v":{"$error":"#DIV/0!"}},{"$f":"100-(BETADIST(H12,(F12/2)-1,(F12/2)-1))*100","v":{"$error":"#DIV/0!"}},3000]
[]
[]
[]
[]
[]
[]
[]
[]
[]
["2-sided Beta PWL Calculation"]
["Sublot",null,"Lot Averge","Lot Standard Deviation","QUV","Number Tests in Lot","d2","x","PWLUV","USL","QLLV","d2","x","PWLLV","LSL","PWL"]
["1",5.0999999999999996]
["2"]
["3"]
["4"]
["5"]
["6"]
["7"]
["8"]
["9"]
["10"]
["11"]
["12"]
["13"]
["14"]
["15"]
["16"]
["17"]
["18"]
["19"]
["20"]
["21"]
["22",5.4]
["23",5.3]
["24"]
["25"]
["26"]
["27"]
["28"]
[null,null,{"$f":"AVERAGE(B24:B52)","v":5.2666666666666666},{"$f":"IF(STDEV(B24:B52)<0.001,0.001,STDEV(B24:B52))","v":0.152752523165195},{"$f":"(J52-C52)/D52","v":17.893866999351339},{"$f":"COUNT(B24:B52)","v":3},{"$f":"SQRT(F52)","v":1.7320508075688772},"=IF(MAX(0,0.5-(E52*G52/(2*(F52-1))))>1,1,MAX(0,0.5-(E52*G52/(2*(F52-1)))))",{"$f":"100-(BETADIST(H52,(F52/2)-1,(F52/2)-1))*100","v":{"$error":"#VALUE!"}},8,{"$f":"(C52-O52)/D52","v":1.7457431218879349},{"$f":"SQRT(F52)","v":1.7320508075688772},{"$f":"IF(MAX(0,0.5-(K52*L52/(2*(F52-1))))>1,1,MAX(0,0.5-(K52*L52/(2*(F52-1)))))","v":0},{"$f":"100-(BETADIST(M52,(F52/2)-1,(F52/2)-1))*100","v":100},5,{"$f":"N52+I52-100","v":{"$error":"#VALUE!"}}]